Wem Brewing Company
product: Beer
type: Brewery
type: Company108058098
type: YagoLegalActorGeo
type: YagoLegalActor
type: Organisation
type: Institution108053576
type: Agent
type: organization
type: Group100031264
type: SocialGroup107950920
type: Abstraction100002137
type: SocialPerson
type: Organization
type: Thing
type: Company
type: Organization108008335
type: YagoPermanentlyLocatedEntity
comment: Wem Brewing Company (originally known as Hanby Ales Ltd) is a micro brewery in Wem Shropshire, established in 1988 that produces a range of ales.
name: Wem Brewing Company
founding year: 1988
industry: Alcoholic beverage
internationally: true
location city: Shropshire
location city: Wem
subject: Category:Beer and breweries in England
subject: Category:Companies based in Shropshire
wiki page ID: 17110719
wiki page revision ID: 605335418
foundation: 1988
homepage: http://www.hanbyales.co.uk/
founder: Peter Simmonds and Jack Hanby
intl: yes
location country: England
predecessor: Hanby Ales
has photo collection: Wem Brewing Company
products: Beer

Oettinger Beer
product: Beer
type: Brewery
type: Agent
type: SocialPerson
type: Organization108008335
type: Abstraction100002137
type: SocialGroup107950920
type: YagoLegalActor
type: Group100031264
type: Company
type: Thing
type: Organisation
type: Institution108053576
type: YagoPermanentlyLocatedEntity
type: YagoLegalActorGeo
type: organization
type: Organization
type: Company108058098
label: Oettinger Brauerei @de
label: Oettinger @fr
label: Cervejaria Oettinger @pt
comment: A Cervejaria Oettinger (em alemão: Oettinger Brauerei GmbH) é um grupo de cervejarias em 5 locais na Alemanha. Com sede em Oettingen, produz cerveja também em Gotha, Schwerin, Mönchengladbach e, desde 2009, também em Braunschweig. Tem atualmente cerca de 930 funcionários. A unidade de produção em Pritzwalk/Dessow foi fechada em 2009.Foi a marca de cerveja nº 1 na Alemanha em 2009, com produção de 6,59 milhões de hectolitros no período, uma queda de 1,9% em relação a 2008.== §Referências == @pt
comment: Die Oettinger Brauerei GmbH ist eine Brauereigruppe mit vier Standorten in Deutschland. Neben der Zentrale in der schwäbischen Kleinstadt Oettingen wird auch in Gotha, Mönchengladbach und Braunschweig Bier gebraut. 2011 waren insgesamt etwa 1150 Mitarbeiter beschäftigt. Mit einem Bierabsatz von 6,6 Millionen Hektolitern (2009) gehört Oettinger zu den großen deutschen Brauereigruppen. Das Familienunternehmen produziert seine eigene Marke Oettinger sowie Handelsmarken für Supermärkte. @de
comment: Oettinger Brauerei - niemiecka grupa piwowarska, wywodząca się z Bawarii. @pl
comment: La bière Oettinger produite par la brasserie Oettinger Brauerei GmbH est brassée dans cinq brasseries en Allemagne employant 930 personnes : Oettingen, Gotha, Schwerin, Mönchengladbach et Brunswick. @fr
comment: Oettinger Brauerei is a brewery group in Germany. Oettinger has been Germany's best selling beer brand since 2004 (when it superseded Krombacher) with an annual output of 621 million litres in 2011.Oettinger's headquarters are in Oettingen in Bayern but there are also breweries in Gotha, Mönchengladbach and Braunschweig.
comment: La Oettinger è un Gruppo che comprende 5 birrifici tedeschi siti a Oettingen in Baviera, Gotha, Schwerin, Mönchengladbach e Braunschweig. Ogni birrificio produce il proprio marchio regionale assieme al marchio nazionale Original Oettinger.L’azienda dichiara che tutte le birre sono prodotte secondo il Reinheitsgebot @it
name: Oettinger Brauerei GmbH
abstract: La bière Oettinger produite par la brasserie Oettinger Brauerei GmbH est brassée dans cinq brasseries en Allemagne employant 930 personnes : Oettingen, Gotha, Schwerin, Mönchengladbach et Brunswick. L'usine de Pritzwalk/Dessow a été vendu en 2009 à la brasserie Feldschlößchen-Brauerei (de) du groupe Carlsberg.Bien que l'histoire de la brasserie remonte à 1313 à Oettingen, la véritable brasserie industrielle ne naît qu'en 1731 ; plus tard en 1956, la Fürstliche Brauhaus zu Oettingen fut transformée par la famille Kollmar (Ingrid Kollmar 64,5 %, Günther Kollmar 11,1 % et Dirk Kollmar 24,4 %) en Oettinger Brauerei GmbH avec pour vocation de produire une bière bon marché. Depuis 2004, c'est la plus grande brasserie privée allemande, avec une production de 6,4 millions d'hectolitres (dont 1 million de boissons non alcoolisées). Toutes les bières sont produites selon le Reinheitsgebot. @fr
abstract: Oettinger Brauerei - niemiecka grupa piwowarska, wywodząca się z Bawarii. Swoją główną siedzibę ma w mieście Oettingen in Bayern, oprócz tego piwo produkowane jest także w browarach znajdujących się w miejscowościach Gotha, Mönchengladbach i Braunschweig (browary te znajdują się poza Bawarią i zostały zakupione, aby dotrzeć do klientów w innych częściach kraju).Zatrudnia około 1250 pracowników i produkuje 6,6 miliona hektolitrów piwa rocznie, co czyni grupę największą firmą piwowarską w Niemczech.Produkty grupy piwowarskiej charakteryzują się niskimi cenami, osiągniętymi dzięki redukcji kosztów produkcji; m.in. browar nie prowadzi akcji reklamowych, piwo dostarcza bez pośredników, a produkcja jest wysoce zautomatyzowana. @pl
founding year: 1333
industry: Brewery
location city: Oettingen in Bayern
location country: Germany
number of employees: 1100
type: Gesellschaft mit beschränkter Haftung
subject: Category:Beer brewing companies in Germany
subject: Category:1333 establishments
subject: Category:Beer brands of Germany
type: Beer
wiki page revision ID: 644833021
foundation: 1333
homepage: http://www.oettinger-bier.de
num employees: 1100
owner: Dirk Kollmar, Kurt Meyer, Michael Mayer
products: Beer
has photo collection: Oettinger Beer
wiki page ID: 26444880

Hall & Woodhouse
product: Beer
type: Brewery
type: Organization108008335
type: Group100031264
type: Institution108053576
type: Organisation
type: Abstraction100002137
type: SocialGroup107950920
type: CompaniesEstablishedIn1777
type: SocialPerson
type: organization
type: CompaniesEstablishedInThe18thCentury
type: CompaniesBasedInDorset
type: Company108058098
type: Agent
type: Company
type: YagoPermanentlyLocatedEntity
type: YagoLegalActor
type: Organization
type: YagoLegalActorGeo
type: Thing
comment: Hall and Woodhouse is a British regional brewery founded in 1777 by Charles Hall in Blandford Forum, Dorset, England. The company operates over 250 public houses in the south of England, and brews under the name Badger Brewery.
name: Badger Brewery
name: Hall & Woodhouse
founding year: 1777
industry: Alcoholic beverage
location: Blandford St Mary
location: Dorset
subject: Category:1777 establishments
subject: Category:Beer and breweries in England
subject: Category:Companies established in 1777
subject: Category:Companies established in the 18th century
subject: Category:Companies based in Dorset
wiki page ID: 1763822
wiki page revision ID: 622806349
foundation: 1777
owner: Woodhouse family
products: Beer
has photo collection: Hall & Woodhouse
wordnet type: synset-brewery-noun-1
location: United Kingdom

Celis
product: Beer
type: Brewery
type: organization
type: Institution108053576
type: Organization108008335
type: YagoLegalActorGeo
type: YagoPermanentlyLocatedEntity
type: Thing
type: Company
type: SocialPerson
type: Organisation
type: YagoLegalActor
type: Group100031264
type: Abstraction100002137
type: Company108058098
type: Organization
type: Agent
type: SocialGroup107950920
label: Celis brewery @nl
label: セリス @ja
comment: Celis brewery was een brouwerij gevestigd in Austin (Texas). @nl
comment: Celis is a beer brand. Originally an independent based in Austin, Texas, it was owned by Michigan Brewing Company for a decade, and sold in 2012.
comment: セリス(Celis)は、ベルギー式のホワイトビールであるセリス・ホワイトや、セリス・ペールボック、ペイルライダー・エール（クリント・イーストウッドの映画に由来）等の醸造酒のブランド。セリス醸造所はベルギーの醸造家ピエール・セリスにより1992年にアメリカ合衆国テキサス州オースティンに設立された。セリスはそれ以前に、彼の故郷であるベルギーのヒューガルデンにちなむヒューガルデン醸造所を設立していた。多くの人々がセリスは合衆国に転居したと思い込んでいるが、実際にはセリス自身が合衆国を訪れた事はない。しかしながら、セリスの娘であるクリスティーヌと、前夫ペーター・カンプスが、テキサスに転居してセリス醸造所を運営した。それにも関わらず、セリスは1990年代のクラフトビールのブームにおける主導的人物となっていった。セリス醸造所は、国道290号線と州間高速道路35号線の道路沿いある、テキサス州オースティンの北東の小さな建物の中にあった。ミラー社はセリス醸造所に出資し、流通を管理するようになった。数年後に、セリスには彼の株式を買い戻すか、事前に交渉された価格で醸造所をミラー社に売却するかの選択が与えられ、セリスは醸造所を売却した。ミラー社はセリスビールが充分な収益を発生させていなかったという主張の下に、最終的にセリス醸造所を閉鎖した。2001年2月に、最後のセリスビールが店頭に出荷された。2002年後半に、ミシガンブルーイング社はミラー社からセリスのブランド名を取得したと発表した。2002年12月に、セリス・ホワイトとセリス・ペールボックは再びパブに出荷され始めた。ミシガンブルーイング社は、現在セリス・ホワイト、セリス・ペールボック、セリス・ラズベリー、セリス・グランクリュを販売している。 @ja
name: Celis Brewery
founded by: Pierre Celis
industry: Alcoholic beverage
internationally: true
location city: Austin, Texas
owner: Michigan Brewing Company
owning company: Michigan Brewing Company
subject: Category:Beer brewing companies based in Texas
wiki page ID: 172115
wiki page revision ID: 615840764
founder: Pierre Celis
intl: yes
location country: USA
products: Beer
has photo collection: Celis
wordnet type: synset-brewery-noun-1

Younger's
product: Beer
type: Brewery
type: Agent
type: SocialPerson
type: Organization
type: organization
type: Company
type: Organisation
type: Thing
comment: Younger’s was an Edinburgh brewery which grew from humble beginnings in 1778 to become one of the city’s main commercial enterprises, supplying domestic and foreign markets. It should not be confused with another, less renowned Edinburgh brewery, that of Robert Younger, who also brewed in Holyrood at the St. Ann's Brewery. In 1931 Younger's merged with McEwan’s to form Scottish Brewers, which in turn merged with Newcastle Breweries in 1960 to form Scottish & Newcastle.
name: Younger's
founding year: 1778
abstract: Younger’s was an Edinburgh brewery which grew from humble beginnings in 1778 to become one of the city’s main commercial enterprises, supplying domestic and foreign markets. It should not be confused with another, less renowned Edinburgh brewery, that of Robert Younger, who also brewed in Holyrood at the St. Ann's Brewery. In 1931 Younger's merged with McEwan’s to form Scottish Brewers, which in turn merged with Newcastle Breweries in 1960 to form Scottish & Newcastle. By the late 1960s the combine employed the largest single workforce in the city.The company’s UK operations were taken over by Heineken in 2008. In October 2011 the Bedford-based Wells & Young's Brewery announced that it had purchased the Younger's and McEwan's brands from Heineken UK.
industry: Alcoholic beverage
internationally: true
location city: Edinburgh
owner: Wells & Young's Brewery
owning company: Wells & Young's Brewery
subject: Category:Companies based in Edinburgh
subject: Category:Beer and breweries in Scotland
subject: Category:Scottish brands
wiki page revision ID: 582234856
wiki page ID: 18759306
foundation: 1778
founder: Archibald Campbell Younger
intl: yes
location country: Scotland
logo: 140
successor: Scottish Brewers
products: Beer
has photo collection: Younger's
type: Brewing company

Franches-Montagnes Brewery
product: Beer
type: Brewery
type: Thing
type: Organisation
type: Agent
type: Company
type: SocialPerson
type: organization
type: Organization
label: Brasserie des Franches Montagnes @fr
comment: La Brasserie des Franches Montagnes ou BFM est une petite brasserie artisanale suisse, située dans la région des Franches-Montagnes à Saignelégier dans le canton du Jura. Elle a été créée en 1997 par Jérôme Rebetez, qui l'a fait connaître notamment par l'utilisation de techniques et d'ingrédient inhabituels. Ainsi, dans la gamme, on peut trouver une bière vieillie en fûts ayant contenu du vin, une bière agrémentée de thé, ou une autre intégrant le poivre de Sarawak. @fr
comment: Franches-Montagnes Brewery (Brasserie des Franches-Montagnes (BFM)) is a small artisanal brewery in Jura, Switzerland whose products, including barrel-aged beers, have drawn international acclaim. Founded in 1997 by Jérôme Rebetez, who had formerly been trained as an oenologist, this tiny brewery has rapidly become known for making beers that stretch traditional beer style guidelines and use unorthodox ingredients.BFM's products are made in small batches and hand-packaged at the brewery.
name: Franches-Montagnes Brewery
abstract: La Brasserie des Franches Montagnes ou BFM est une petite brasserie artisanale suisse, située dans la région des Franches-Montagnes à Saignelégier dans le canton du Jura. Elle a été créée en 1997 par Jérôme Rebetez, qui l'a fait connaître notamment par l'utilisation de techniques et d'ingrédient inhabituels. Ainsi, dans la gamme, on peut trouver une bière vieillie en fûts ayant contenu du vin, une bière agrémentée de thé, ou une autre intégrant le poivre de Sarawak. La brasserie jouit d'une certaine reconnaissance, à titre d'exemple, on peut citer le choix, par le New York Times, d'élire "l'Abbaye de Saint Bon-Chien" meilleure bière élevée en fûts de chêne du monde. Malgré cette reconnaissance, la brasserie garde des dimensions modestes, en effet, elle ne représente que 0,02 % du marche suisse. @fr
founding year: 1997
industry: Alcoholic beverage
location: Switzerland
subject: Category:Beer and breweries in Switzerland
wiki page ID: 25039408
wiki page revision ID: 631563518
foundation: 1997
location: Chemin Des Buissons 8, Saignelégier, Switzerland
native name: Brasserie des Franches-Montagnes
owner: Jerome Rebetez
products: Beer

Monday Night Brewing
product: Beer
type: Brewery
type: organization
type: Company
type: Organization
type: Organisation
type: SocialPerson
type: Agent
type: Thing
comment: Monday Night Brewing is a craft brewery founded in 2006 by Jonathan Baker, Jeff Heck, and Joel Iverson in Atlanta, Georgia.
name: Monday Night Brewing
industry: Alcoholic beverage
internationally: false
location city: Atlanta
subject: Category:Beer brewing companies based in Georgia (U.S. state)
subject: Category:Companies established in 2006
subject: Category:Companies based in Atlanta, Georgia
wiki page ID: 39168261
wiki page revision ID: 639692149
founder: Jonathan Baker, Jeff Heck, and Joel Iverson
homepage: http://www.mondaynightbrewing.com
intl: no
location country: United States
logo: 250
products: Beer

SKA Brewing
product: Beer
type: Brewery
type: SocialPerson
type: Microbreweries
type: Thing
type: Company
type: Microbrewery103758992
type: Object100002684
type: PhysicalEntity100001930
type: YagoGeoEntity
type: Agent
type: YagoPermanentlyLocatedEntity
type: Brewery102897237
type: organization
type: Organization
type: Plant103956922
type: Artifact100021939
type: BuildingComplex102914991
type: Organisation
comment: Ska Brewing Company is a brewery founded in 1995 by Bill Graham and Dave Thibodeau in Durango, Colorado, USA. Since 2008, the brewery has been located in its current Bodo Industrial Park location. Its beer names and branding revolve around ska and rude boy culture.
name: Ska Brewing Company
founding year: 1995
industry: Alcoholic beverage
location: Colorado
location: United States
location: Durango, Colorado
production: 21000
subject: Category:Beer brewing companies based in Colorado
wiki page ID: 35173067
wiki page revision ID: 630692045
foundation: 1995
location: 225
location: Durango, CO 81303
products: Beer
has photo collection: SKA Brewing
type: Whole100003553
type: Structure104341686

Upper Canada Brewing Company
product: Beer
type: Brewery
type: organization
type: Microbrewery103758992
type: Microbreweries
type: Agent
type: Whole100003553
type: Organization
type: Company
type: Structure104341686
type: Brewery102897237
type: SocialPerson
type: YagoPermanentlyLocatedEntity
type: PhysicalEntity100001930
type: YagoGeoEntity
type: Thing
type: Plant103956922
type: Object100002684
type: BuildingComplex102914991
type: Organisation
type: Artifact100021939
comment: Upper Canada Brewing Company is a brewery in Guelph, Ontario, Canada. Founded by Frank Heaps in Toronto, it started brewing beer in 1985 and grew to become one of the largest independent breweries in Canada.Its location at 2 Atlantic Ave.
name: Upper Canada Brewing Company
abstract: Upper Canada Brewing Company is a brewery in Guelph, Ontario, Canada. Founded by Frank Heaps in Toronto, it started brewing beer in 1985 and grew to become one of the largest independent breweries in Canada.Its location at 2 Atlantic Ave. in Toronto included a "gift shop" that allowed the independent brewer to sell alcohol on Sunday, something that Ontario's licensed outlet Beer Store chain, which had a virtual monopoly on beer sales, was not permitted to do at the time.The company was sold to private investors in 1995, went public in 1996, and was finally acquired by Sleeman Breweries in 1998. Soon afterwards Frank Heaps' son (Cameron) used the profits his father made from selling Upper Canada Brewing Co. to open another Toronto based brewery in 2000, Steam Whistle Brewing. Upper Canada's production was moved to the more efficient brewing facility in Guelph, and is still available for purchase on Sunday, at the Guelph Brewery retail store.There has been somewhat of a revival for the brand in the last couple of years, as it was repositioned as a value-craft beer ("Craft beer without the Premium price"), and sales have grown.UCBC products are found at most Beer Store outlets in Ontario in 24 pack formats ($30.95), as well as at select locations of the government owned LCBO liquor store chain in 6-pack bottles ($9.75).
founding year: 1985
industry: Alcoholic beverage
location: Canada
location: Ontario
owner: Sleeman Breweries
owning company: Sleeman Breweries
subject: Category:Companies based in Guelph
subject: Category:Canadian brewing companies
subject: Category:1985 establishments in Ontario
subject: Category:Companies established in 1985
wiki page ID: 1656010
wiki page revision ID: 636545056
caption: The Upper Canada Brewing Company.
foundation: 1985
location: Guelph
products: Beer
has photo collection: Upper Canada Brewing Company
wordnet type: synset-brewery-noun-1

Guinness Nigeria
type: Brewery
product: Beer
type: YagoLegalActorGeo
type: organization
type: Organization
type: YagoPermanentlyLocatedEntity
type: SocialPerson
type: Agent
type: Group100031264
type: Thing
type: CompaniesOfNigeria
type: Abstraction100002137
type: YagoLegalActor
type: Company108058098
type: CompaniesListedOnTheNigerianStockExchange
type: Organisation
type: Company
type: SocialGroup107950920
type: Institution108053576
type: Organization108008335
comment: Guinness Nigeria, a subsidiary of Diageo Plc of the United Kingdom, was incorporated in 1962 with the building of a brewery in Ikeja, the heart of Lagos. The brewery was the first outside of Ireland and Great Britain. Other breweries have been opened over time – Benin City brewery in 1974 and Ogba brewery in 1982.
name: Guinness Nigeria Plc
founding date: 1950-04-29
founding year: 1950
industry: Alcoholic beverage
internationally: true
location city: Ikeja
location country: Nigeria
number of employees: 1332
owner: Diageo
owning company: Diageo
revenue: 1.23663125E11
subject: Category:Diageo
subject: Category:Companies of Nigeria
subject: Category:Companies listed on the Nigerian Stock Exchange
subject: Category:Companies based in Lagos
subject: Category:Beer and breweries in Nigeria
wiki page ID: 1774692
wiki page revision ID: 642721915
foundation: 1950-04-29
homepage: http://www.guinness-nigeria.com
intl: yes
key people: Mr Babatunde Abayomi Savage
location city: 24
locations: Lagos
locations: Benin City
num employees: 1332
owner: Diageo Guinness Overseas Limited , Atalantaf Ltd. Nigerian Citizens
products: Beer Brewing, Bottling and Marketing of Guinness Foreign Extra Stout, Harp Lager, Malta Guinness and other Beverages
traded as: NSE: GUINNESS
locations: Aba, Abia
type: Listed
has photo collection: Guinness Nigeria

Hahn Brewery
product: Beer
type: Brewery
type: Thing
type: Relation100031921
type: Organization
type: Abstraction100002137
type: TradeName106845599
type: AustralianBrands
type: Agent
type: BeerBrands
type: organization
type: Name106333653
type: Part113809207
type: SocialPerson
type: Company
type: Organisation
type: LanguageUnit106284225
comment: Hahn Brewery was established by Dr Charles "Chuck" Hahn in 1988 at an old factory site in the suburb of Camperdown in Sydney, New South Wales, Australia.It was originally a brewer of premium beers, including Hahn Premium and Hahn Premium Light. The 1991 recession resulted in reduced demand, and forced a rethink of this policy. A more mainstream beer called Sydney Bitter was produced, with reasonable success.
name: Hahn Brewery
abstract: Hahn Brewery was established by Dr Charles "Chuck" Hahn in 1988 at an old factory site in the suburb of Camperdown in Sydney, New South Wales, Australia.It was originally a brewer of premium beers, including Hahn Premium and Hahn Premium Light. The 1991 recession resulted in reduced demand, and forced a rethink of this policy. A more mainstream beer called Sydney Bitter was produced, with reasonable success. It has launched two new beers since then: Hahn Super Dry in 2006 and Hahn Super Dry 3.5 in 2009. In 1993 the brewery was purchased by conglomerate Lion Nathan. Chuck was appointed as the Chief Brewer of the Lion Nathan Group which, at the time, operated eight breweries in Australia and New Zealand and two in China. Production of Hahn beers was moved to the Tooheys brewery in Auburn. The Camperdown brewery itself was renamed to the Malt Shovel Brewery in honour of Australia's first known brewery run and owned by James Squire. It is still operated under the direction of Chuck Hahn.
founding year: 1986
industry: Alcoholic beverage
location: Auburn, New South Wales
location: Australia
owner: Lion (Australasian company)
owning company: Lion (Australasian company)
subject: Category:1986 establishments in Australia
subject: Category:Companies established in 1986
subject: Category:Beer brewing companies based in New South Wales
subject: Category:Kirin Group
subject: Category:Australian beer brands
wiki page ID: 1778606
wiki page revision ID: 632378440
foundation: 1986
founder: Charles Hahn
homepage: http://www.hahn.com.au/
products: Beer
has photo collection: Hahn Brewery

Alken-Maes
type: Brewery
product: Beer
type: Organization
type: organization
type: Agent
type: SocialPerson
type: Thing
type: Company
type: Organisation
label: Brouwerijen Alken-Maes @nl
comment: Alken-Maes est une entreprise brassicole belge créée en 1988 lors de la fusion des brasseries Maes et Alken. Ayant par le passé appartenu à Danone puis à Scottish & Newcastle, elle fait partie aujourd'hui du groupe Heineken. @fr
comment: Alken-Maes is a Belgian brewery created out of the 1988 merger of two small breweries, Maes located at Kontich-Waarloos and Cristal-Alken located at Alken. It was bought by Scottish & Newcastle in 2000, who were taken over by Carlsberg and Heineken in 2007.
comment: Alken-Maes – belgijska grupa piwowarska powstała z połączenia dwóch mniejszych browarów Maes w Waarloos i Alken. W 2000 r. grupa przejęta została przez browar Scottish & Newcastle, który z kolei w 2007 r. kupiło konsorcjum Carlsberg and Heineken. @pl
comment: Alken-Maes ist eine belgische Bierbrauerei mit Firmensitz in Mechelen; sie gehört zum weltweit aufgestellten Brauereiverbund der niederländischen Heineken-Gruppe. @de
comment: Brouwerijen Alken-Maes is de tweede grootste brouwbedrijf van België. Het ontstond in 1988 uit de fusie van Brouwerij Maes en de Brouwerij van Alken. Sinds 2008 maakt het deel uit van de Heineken-groep. @nl
name: Alken-Maes
internationally: true
industry: Alcoholic beverage
wiki page ID: 1456515
wiki page revision ID: 637456675
subject: Category:Beer and breweries in Belgium
intl: yes
has photo collection: Alken-Maes
products: Beer

The RDF Concepts Vocabulary (RDF)
type: Ontology
description: This is the RDF Schema for the RDF vocabulary terms in the RDF Namespace, defined in RDF 1.1 Concepts.

HTML
type: Datatype
comment: The datatype of RDF literals storing fragments of HTML content
subclass of: Literal

langString
subclass of: Literal
type: Datatype
comment: The datatype of language-tagged string values

PlainLiteral
type: Datatype
subclass of: Literal
comment: The class of plain (i.e. untyped) literal values, as used in RIF and OWL 2

type
type: Property
comment: The subject is an instance of a class.
range: Class
domain: Resource

Property
type: Class
comment: The class of RDF properties.
subclass of: Resource

Statement
type: Class
subclass of: Resource
comment: The class of RDF statements.

subject
type: Property
comment: The subject of the subject RDF statement.
domain: Statement
range: Resource

predicate
type: Property
domain: Statement
range: Resource
comment: The predicate of the subject RDF statement.

object
type: Property
comment: The object of the subject RDF statement.
domain: Statement
range: Resource

Bag
comment: The class of unordered containers.
type: Class
subclass of: Container

Seq
comment: The class of ordered containers.
subclass of: Container
type: Class

Alt
comment: The class of containers of alternatives.
type: Class
subclass of: Container

value
type: Property
comment: Idiomatic property used for structured values.
domain: Resource
range: Resource

Mahou-San Miguel Group
product: Beer
type: Brewery
type: CompaniesBasedInTheCommunityOfMadrid
type: Agent
type: SocialGroup107950920
type: Thing
type: Abstraction100002137
type: organization
type: YagoLegalActor
type: Company
type: Group100031264
type: YagoLegalActorGeo
type: Company108058098
type: YagoPermanentlyLocatedEntity
type: CompaniesEstablishedIn1890
type: Organisation
type: Organization108008335
type: SocialPerson
type: Institution108053576
label: Mahou-San Miguel @fr
label: Grupo Mahou-San Miguel
comment: Le groupe Mahou-San Miguel est l'une des trois plus grandes brasseries espagnoles avec Heineken Espagne et Damm. @fr
comment: Grupo Mahou-San Miguel is de grootste Spaanse bierbrouwerij. Het bedrijf bestaat sinds 2000. In dat jaar kocht de brouwerij Mahou in Madrid een belang van 70% in de San Miguel-brouwerij in Lerida, voordien eigendom van Danone. In 2007 nam het bedrijf de brouwerij Cervezas Alhambra over, brouwer van het bier Alhambra, en werd daarmee de grootste bierproducent van Spanje. @nl
comment: For the Philippine food and beverage company, see San Miguel Corporation.Grupo Mahou-San Miguel is a Spanish brewing company, founded in Madrid in 1890 under the name of Hijos de Casimiro Mahou, fabrica de hielo y cerveza (The Sons of Casimiro Mahou, production of ice and beer). Mahou-San Miguel is the leading brand in the Spanish beer market.
comment: Mahou San Miguel es una empresa cervecera española con sede central en Madrid y segunda sede en Barcelona y Granada. El grupo distribuye tres marcas principales de cerveza: Mahou, San Miguel y Alhambra. Es el mayor productor español de cerveza., y ostenta el 75% del mercado de cerveza española exportada. Mahou San Miguel está presente en 50 países y tiene más de 2.500 empleados. En 2011 el grupo diversificó su negocio con la compra de la empresa de agua mineral Solán de Cabras. @es
type: Organization
founding year: 1890
industry: Drink
location: Madrid
subject: Category:Companies established in 1890
subject: Category:Beer and breweries in Spain
subject: Category:Companies based in the Community of Madrid
wiki page revision ID: 638536987
wiki page ID: 4624383
company name: Grupo Mahou-San Miguel
foundation: 1890
homepage: http://www.mahou-sanmiguel.com/
products: Beers
has photo collection: Mahou-San Miguel Group

List
type: Class
comment: The class of RDF Lists.
subclass of: Resource

nil
comment: The empty list, with no items in it. If the rest of a list is nil then the list has no more items in it.

first
type: Property
comment: The first item in the subject RDF list.
domain: List
range: Resource

rest
type: Property
comment: The rest of the subject RDF list after the first item.
domain: List
range: List

XMLLiteral
type: Datatype
subclass of: Literal
comment: The datatype of XML literal values.

Detroit Beer Company
product: Beer
type: Brewery
type: Organization
type: Thing
type: Organisation
type: YagoLegalActorGeo
type: Company108058098
type: YagoPermanentlyLocatedEntity
type: CompaniesBasedInDetroit,Michigan
type: Company
type: SocialPerson
type: organization
type: YagoLegalActor
type: Organization108008335
type: Agent
type: Institution108053576
type: Abstraction100002137
type: Group100031264
type: SocialGroup107950920
comment: Detroit Beer Co. is a brewpub located on Broadway Street in downtown Detroit, Michigan, United States. Detroit Beer Co. opened in the fall of 2003 and is part of a trio of local breweries, including the Royal Oak Brewery (1995) and the Rochester Mills Beer Co. (1998). The Detroit Beer Co. was launched by Drew Ciora and Mike Pelsz, who purchased and renovated the historical Hartz building at a cost of $5.3 million.
name: Detroit Beer Co.
abstract: Detroit Beer Co. is a brewpub located on Broadway Street in downtown Detroit, Michigan, United States. Detroit Beer Co. opened in the fall of 2003 and is part of a trio of local breweries, including the Royal Oak Brewery (1995) and the Rochester Mills Beer Co. (1998). The Detroit Beer Co. was launched by Drew Ciora and Mike Pelsz, who purchased and renovated the historical Hartz building at a cost of $5.3 million. The Hartz Building was an early 20th-century surgical supply store and was renovated to accommodate a restaurant, brewery equipment, office space, and even a loft apartment. Within close proximity of both Comerica Park and Ford Field, it has certainly made its impact on the culture that is the Motor City.
industry: Restaurant
founding year: 2003
industry: Alcoholic beverage
internationally: true
location city: Detroit
subject: Category:Companies based in Detroit, Michigan
subject: Category:Beer brewing companies based in Michigan
wiki page ID: 33169636
wiki page revision ID: 601845239
foundation: 2003
founder: Drew Ciora, Richard Ghersi and Mike Pelsz
homepage: http://www.detroitbeerco.com/
intl: yes
location country: United States
products: Beer
has photo collection: Detroit Beer Company

Upland Brewing Company
product: Beer
type: Brewery
type: BuildingComplex102914991
type: PhysicalEntity100001930
type: YagoGeoEntity
type: Plant103956922
type: Object100002684
type: SpatialThing
type: Microbrewery103758992
type: Microbreweries
type: Organisation
type: Agent
type: Brewery102897237
type: Artifact100021939
type: organization
type: SocialPerson
type: Company
type: Whole100003553
type: Thing
type: Organization
type: Structure104341686
type: YagoPermanentlyLocatedEntity
point: 39.1735 -86.5374
comment: Upland Brewing Company, founded in 1997, is a brewery in Bloomington, Monroe County, Indiana. It is currently the second largest brewery in Indiana and as of 2011 has over 10,000 barrels of production.
name: Upland Brewing Company
latitude: 39.1735
longitude: -86.5374
founding year: 1997
industry: Alcoholic beverage
location: United States
location: Bloomington, Indiana
owner: Local investors
owning company: Local investors
production: 35000
geometry: POINT(-86.537399291992 39.173500061035)
subject: Category:Companies based in Indiana
wiki page ID: 4041075
subject: Category:Beer brewing companies based in Indiana
wiki page revision ID: 636611369
foundation: 1997
wordnet type: synset-brewery-noun-1
has photo collection: Upland Brewing Company
products: Beer

Malt Shovel Brewery
product: Beer
type: Brewery
type: Agent
type: organization
type: Company
type: SocialPerson
type: Organization
type: Thing
type: Organisation
comment: The Malt Shovel Brewery is an Australian brewery owned by Lion Nathan and located in Camperdown, New South Wales. It is best known for the James Squire range of beers. The beer is named after the convict brewer James Squire, who is said to have created Australia's first commercial brewery.
name: Malt Shovel Brewery
founding year: 1998
industry: Alcoholic beverage
owner: Lion (Australasian company)
location: Camperdown, New South Wales
owning company: Lion (Australasian company)
subject: Category:Australian beer brands
subject: Category:Beer brewing companies based in New South Wales
subject: Category:Beverage companies established in 1998
subject: Category:1998 establishments in Australia
wiki page revision ID: 640017134
wiki page ID: 14115416
foundation: 1998
location: 99
homepage: http://www.malt-shovel.com.au/ Malt Shovel Brewery website
products: Beer

James Page Brewing Company
product: Beer
type: Brewery
type: Agent
type: YagoLegalActorGeo
type: Organisation
type: YagoLegalActor
type: DefunctCompaniesBasedInWisconsin
type: YagoPermanentlyLocatedEntity
type: SocialPerson
type: Group100031264
type: Organization
type: Thing
type: Institution108053576
type: Abstraction100002137
type: SocialGroup107950920
type: organization
type: Company108058098
type: Company
type: Organization108008335
type: DefunctBreweryCompaniesOfTheUnitedStates
name: James Page Brewing Company
comment: James Page Brewing Company was one of the earliest craft breweries to come out of the late-1980s American micro-brewing explosion and one of the first craft brewery in the US to package its beer in cans starting in 1998. The brand is currently produced at the Stevens Point Brewing Company in Stevens Point, Wisconsin.
extinction year: 2005
founding year: 1986
industry: Alcoholic beverage
internationally: true
location city: Stevens Point, Wisconsin
subject: Category:Defunct brewery companies of the United States
subject: Category:Defunct companies based in Wisconsin
wiki page ID: 2219260
wiki page revision ID: 622635640
foundation: 1986
defunct: 2005
founder: James Page
intl: yes
location country: United States
logo: 124
products: Beer
has photo collection: James Page Brewing Company
wordnet type: synset-brewery-noun-1

Ashton Gate Brewery Co
product: Beer
type: Brewery
type: Organisation
type: Organization
type: Company
type: Agent
type: Thing
type: SocialPerson
type: organization
name: Ashton Gate Brewery Co Ltd
comment: Ashton Gate Brewery Co Ltd (also known for a time as Hardwick and Co Ltd) was a brewing company based in Bristol, UK. It was one of the first 1000 companies registered in England and Wales.
foundation place: Bristol
extinction year: 1931
fate: Acquired byBristol Brewery Georges & Co
founding year: 1865
location city: Bristol
industry: Brewing
type: Privately held company
subject: Category:Beer and breweries in England
wiki page ID: 37973108
fate: Acquired by Bristol Brewery Georges & Co
foundation: Bristol, UK
defunct: /
wiki page revision ID: 642494358
founder: Thomas Baynton
location country: UK
products: Beer
has photo collection: Ashton Gate Brewery Co

Bunker Hill Breweries
product: Beer
type: Brewery
type: Organization
type: CompaniesBasedInBoston,Massachusetts
type: DefunctCompaniesBasedInMassachusetts
type: Company
type: DefunctBreweryCompaniesOfTheUnitedStates
type: CompaniesDisestablishedIn1918
type: SocialGroup107950920
type: Abstraction100002137
type: CompaniesEstablishedIn1821
type: YagoLegalActorGeo
type: YagoPermanentlyLocatedEntity
type: Institution108053576
type: Organization108008335
type: Organisation
type: Agent
type: Thing
type: Group100031264
type: YagoLegalActor
type: organization
type: Company108058098
type: SocialPerson
abstract: Bunker Hill Breweries was a brewery founded in 1821 in Charlestown, Massachusetts, USA.Bunker Hill Breweries was founded in 1821 by John Cooper and Thomas Gould.
founding year: 1821
extinction year: 1918
industry: Alcoholic beverage
location city: Charlestown, Boston
product: Ale
subject: Category:Companies based in Boston, Massachusetts
subject: Category:Defunct consumer brands
subject: Category:Defunct companies based in Massachusetts
subject: Category:Companies established in 1821
subject: Category:Defunct brewery companies of the United States
subject: Category:Companies disestablished in 1918
subject: Category:Beer brewing companies based in Massachusetts
wiki page ID: 26151150
defunct: 1918
wiki page revision ID: 618449433
foundation: 1821
founder: John Cooper and Thomas Gould
location country: USA
location city: 40
logo: Bunker Hill Breweries Ad.png
owner: A. G. Van Nostrand; William Van Nostrand
products: Ale
has photo collection: Bunker Hill Breweries
products: Beer

The OWL 2 Schema vocabulary (OWL 2)
type: Ontology
comment: This ontology partially describes the built-in classes and properties that together form the basis of the RDF/XML syntax of OWL 2. The content of this ontology is based on Tables 6.1 and 6.2 in Section 6.4 of the OWL 2 RDF-Based Semantics specification, available at http://www.w3.org/TR/owl2-rdf-based-semantics/. Please note that those tables do not include the different annotations (labels, comments and rdfs:isDefinedBy links) used in this file. Also note that the descriptions provided in this ontology do not provide a complete and correct formal description of either the syntax or the semantics of the introduced terms (please see the OWL 2 recommendations for the complete and normative specifications). Furthermore, the information provided by this ontology may be misleading if not used with care. This ontology SHOULD NOT be imported into OWL ontologies. Importing this file into an OWL 2 DL ontology will cause it to become an OWL 2 Full ontology and may have other, unexpected, consequences.
imports: rdf-schema
versionInfo: $Date: 2009/11/15 10:54:12 $
namespace transformation: owx2rdf.xsl

AllDifferent
type: Class
comment: The class of collections of pairwise different individuals.
subclass of: Resource

AllDisjointClasses
type: Class
comment: The class of collections of pairwise disjoint classes.
subclass of: Resource

AllDisjointProperties
comment: The class of collections of pairwise disjoint properties.
type: Class
subclass of: Resource

Annotation
type: Class
comment: The class of annotated annotations for which the RDF serialization consists of an annotated subject, predicate and object.
subclass of: Resource

AnnotationProperty
type: Class
comment: The class of annotation properties.
subclass of: Property

AsymmetricProperty
type: Class
subclass of: ObjectProperty
comment: The class of asymmetric properties.

Axiom
subclass of: Resource
comment: The class of annotated axioms for which the RDF serialization consists of an annotated subject, predicate and object.
type: Class

Class
comment: The class of OWL classes.
subclass of: Class

DataRange
type: Class
comment: The class of OWL data ranges, which are special kinds of datatypes. Note: The use of the IRI owl:DataRange has been deprecated as of OWL 2. The IRI rdfs:Datatype SHOULD be used instead.
subclass of: Datatype

DatatypeProperty
type: Class
comment: The class of data properties.
subclass of: Property

DeprecatedClass
type: Class
comment: The class of deprecated classes.
subclass of: Class

DeprecatedProperty
type: Class
comment: The class of deprecated properties.
subclass of: Property

FunctionalProperty
type: Class
comment: The class of functional properties.
subclass of: Property

InverseFunctionalProperty
type: Class
comment: The class of inverse-functional properties.
subclass of: ObjectProperty

IrreflexiveProperty
comment: The class of irreflexive properties.
subclass of: ObjectProperty
type: Class

NamedIndividual
type: Class
comment: The class of named individuals.
subclass of: Thing

NegativePropertyAssertion
type: Class
comment: The class of negative property assertions.
subclass of: Resource

Nothing
type: Class
comment: This is the empty class.
subclass of: Thing

ObjectProperty
type: Class
comment: The class of object properties.
subclass of: Property

Ontology
type: Class
comment: The class of ontologies.
subclass of: Resource

OntologyProperty
type: Class
subclass of: Property
comment: The class of ontology properties.

ReflexiveProperty
type: Class
comment: The class of reflexive properties.
subclass of: ObjectProperty

Restriction
type: Class
comment: The class of property restrictions.
subclass of: Class

SymmetricProperty
type: Class
comment: The class of symmetric properties.
subclass of: ObjectProperty

TransitiveProperty
type: Class
comment: The class of transitive properties.
subclass of: ObjectProperty

Thing
type: Class
comment: The class of OWL individuals.

allValuesFrom
comment: The property that determines the class that a universal property restriction refers to.
domain: Restriction
range: Class
type: Property

annotatedProperty
type: Property
domain: Resource
comment: The property that determines the predicate of an annotated axiom or annotated annotation.
range: Resource

annotatedSource
type: Property
comment: The property that determines the subject of an annotated axiom or annotated annotation.
domain: Resource
range: Resource

annotatedTarget
type: Property
comment: The property that determines the object of an annotated axiom or annotated annotation.
domain: Resource
range: Resource

assertionProperty
type: Property
comment: The property that determines the predicate of a negative property assertion.
domain: NegativePropertyAssertion
range: Property

backwardCompatibleWith
type: AnnotationProperty
type: OntologyProperty
comment: The annotation property that indicates that a given ontology is backward compatible with another ontology.
domain: Ontology
range: Ontology

bottomDataProperty
type: DatatypeProperty
comment: The data property that does not relate any individual to any data value.
domain: Thing
range: Literal

bottomObjectProperty
type: ObjectProperty
domain: Thing
range: Thing
comment: The object property that does not relate any two individuals.

cardinality
type: Property
comment: The property that determines the cardinality of an exact cardinality restriction.
domain: Restriction
range: nonNegativeInteger

complementOf
type: Property
comment: The property that determines that a given class is the complement of another class.
domain: Class
range: Class

datatypeComplementOf
type: Property
comment: The property that determines that a given data range is the complement of another data range with respect to the data domain.
domain: Datatype
range: Datatype

deprecated
type: AnnotationProperty
comment: The annotation property that indicates that a given entity has been deprecated.
domain: Resource
range: Resource

differentFrom
type: Property
comment: The property that determines that two given individuals are different.
domain: Thing
range: Thing

disjointUnionOf
type: Property
comment: The property that determines that a given class is equivalent to the disjoint union of a collection of other classes.
domain: Class
range: List

disjointWith
comment: The property that determines that two given classes are disjoint.
type: Property
domain: Class
range: Class

distinctMembers
type: Property
comment: The property that determines the collection of pairwise different individuals in a owl:AllDifferent axiom.
domain: AllDifferent
range: List

equivalentClass
type: Property
comment: The property that determines that two given classes are equivalent, and that is used to specify datatype definitions.
domain: Class
range: Class

equivalentProperty
type: Property
comment: The property that determines that two given properties are equivalent.
domain: Property
range: Property

hasKey
type: Property
comment: The property that determines the collection of properties that jointly build a key.
domain: Class
range: List

hasSelf
type: Property
comment: The property that determines the property that a self restriction refers to.
domain: Restriction
range: Resource

hasValue
type: Property
comment: The property that determines the individual that a has-value restriction refers to.
domain: Restriction
range: Resource

imports
type: OntologyProperty
comment: The property that is used for importing other ontologies into a given ontology.
domain: Ontology
range: Ontology

incompatibleWith
type: AnnotationProperty
type: OntologyProperty
comment: The annotation property that indicates that a given ontology is incompatible with another ontology.
domain: Ontology
range: Ontology

intersectionOf
type: Property
comment: The property that determines the collection of classes or data ranges that build an intersection.
domain: Class
range: List

inverseOf
type: Property
comment: The property that determines that two given properties are inverse.
domain: ObjectProperty
range: ObjectProperty

maxCardinality
type: Property
comment: The property that determines the cardinality of a maximum cardinality restriction.
domain: Restriction
range: nonNegativeInteger

maxQualifiedCardinality
type: Property
comment: The property that determines the cardinality of a maximum qualified cardinality restriction.
domain: Restriction
range: nonNegativeInteger

members
type: Property
comment: The property that determines the collection of members in either a owl:AllDifferent, owl:AllDisjointClasses or owl:AllDisjointProperties axiom.
range: List
domain: Resource

minCardinality
type: Property
comment: The property that determines the cardinality of a minimum cardinality restriction.
domain: Restriction
range: nonNegativeInteger

minQualifiedCardinality
type: Property
comment: The property that determines the cardinality of a minimum qualified cardinality restriction.
domain: Restriction
range: nonNegativeInteger

onClass
type: Property
comment: The property that determines the class that a qualified object cardinality restriction refers to.
domain: Restriction
range: Class

onDataRange
type: Property
comment: The property that determines the data range that a qualified data cardinality restriction refers to.
domain: Restriction
range: Datatype

onDatatype
type: Property
comment: The property that determines the datatype that a datatype restriction refers to.
domain: Datatype
range: Datatype

oneOf
type: Property
comment: The property that determines the collection of individuals or data values that build an enumeration.
domain: Class
range: List

onProperties
type: Property
comment: The property that determines the n-tuple of properties that a property restriction on an n-ary data range refers to.
domain: Restriction
range: List

onProperty
type: Property
comment: The property that determines the property that a property restriction refers to.
domain: Restriction
range: Property

priorVersion
type: AnnotationProperty
type: OntologyProperty
comment: The annotation property that indicates the predecessor ontology of a given ontology.
domain: Ontology
range: Ontology

propertyChainAxiom
type: Property
comment: The property that determines the n-tuple of properties that build a sub property chain of a given property.
domain: ObjectProperty
range: List

propertyDisjointWith
type: Property
comment: The property that determines that two given properties are disjoint.
domain: Property
range: Property

qualifiedCardinality
type: Property
comment: The property that determines the cardinality of an exact qualified cardinality restriction.
domain: Restriction
range: nonNegativeInteger

sameAs
type: Property
comment: The property that determines that two given individuals are equal.
domain: Thing
range: Thing

someValuesFrom
type: Property
comment: The property that determines the class that an existential property restriction refers to.
domain: Restriction
range: Class

sourceIndividual
domain: NegativePropertyAssertion
range: Thing
type: Property
comment: The property that determines the subject of a negative property assertion.

targetIndividual
type: Property
comment: The property that determines the object of a negative object property assertion.
domain: NegativePropertyAssertion
range: Thing

targetValue
type: Property
comment: The property that determines the value of a negative data property assertion.
domain: NegativePropertyAssertion
range: Literal

topDataProperty
type: DatatypeProperty
comment: The data property that relates every individual to every data value.
domain: Thing
range: Literal

topObjectProperty
type: ObjectProperty
comment: The object property that relates every two individuals.
range: Thing
domain: Thing

unionOf
type: Property
comment: The property that determines the collection of classes or data ranges that build a union.
domain: Class
range: List

versionInfo
type: AnnotationProperty
comment: The annotation property that provides version information for an ontology or another OWL construct.
domain: Resource
range: Resource

versionIRI
type: OntologyProperty
comment: The property that identifies the version IRI of an ontology.
domain: Ontology
range: Ontology

withRestrictions
type: Property
domain: Datatype
comment: The property that determines the collection of facet-value pairs that define a datatype restriction.
range: List

W3C PROVenance Interchange
type: Ontology
comment: This document is published by the Provenance Working Group (http://www.w3.org/2011/prov/wiki/Main_Page). If you wish to make comments regarding this document, please send them to public-prov-comments@w3.org (subscribe public-prov-comments-request@w3.org, archives http://lists.w3.org/ Archives/Public/public-prov-comments/). All feedback is welcome.
imports: PROV Access and Query Ontology
imports: Dublin Core extensions of the W3C PROVenance Interchange Ontology (PROV-O)
imports: W3C PROVenance Interchange Ontology (PROV-O) Dictionary Extension
imports: W3C PROV Linking Across Provenance Bundles Ontology (PROV-LINKS)
imports: W3C PROVenance Interchange Ontology (PROV-O)
imports: prov-o-inverses#
versionIRI: prov-20130430
wasRevisionOf: prov-20130312

comment
type: AnnotationProperty
type: Property
comment: A description of the subject resource.
domain: Resource
range: Literal

label
type: AnnotationProperty
type: Property
comment: A human-readable name for the subject.
domain: Resource
range: Literal

isDefinedBy
type: AnnotationProperty
subPropertyOf: seeAlso
type: Property
comment: The defininition of the subject resource.
range: Resource
domain: Resource

seeAlso
type: AnnotationProperty
type: Property
comment: Further information about the subject resource.
range: Resource
domain: Resource

Activity
disjointWith: Entity
category: starting-point
component: entities-activities
type: Class
constraints: http://www.w3.org/TR/2013/REC-prov-constraints-20130430/#prov-dm-constraints-fig
definition: An activity is something that occurs over a period of time and acts upon or with entities; it may include consuming, processing, transforming, modifying, relocating, using, or generating entities.
dm: http://www.w3.org/TR/2013/REC-prov-dm-20130430/#term-Activity
n: http://www.w3.org/TR/2013/REC-prov-n-20130430/#expression-Activity

ActivityInfluence
type: Class
comment: ActivityInfluence provides additional descriptions of an Activity's binary influence upon any other kind of resource. Instances of ActivityInfluence use the prov:activity property to cite the influencing Activity.
comment: It is not recommended that the type ActivityInfluence be asserted without also asserting one of its more specific subclasses.
subclass of: Influence
subclass of: Restriction
  maxCardinality: 0
  onProperty: hadActivity
category: qualified
disjointWith: EntityInfluence
editors definition: ActivitiyInfluence is the capacity of an activity to have an effect on the character, development, or behavior of another by means of generation, invalidation, communication, or other.

Agent
type: Class
category: starting-point
disjointWith: InstantaneousEvent
component: agents-responsibility
definition: An agent is something that bears some form of responsibility for an activity taking place, for the existence of an entity, or for another agent's activity.
dm: http://www.w3.org/TR/2013/REC-prov-dm-20130430/#term-agent
n: http://www.w3.org/TR/2013/REC-prov-n-20130430/#expression-Agent

AgentInfluence
type: Class
comment: It is not recommended that the type AgentInfluence be asserted without also asserting one of its more specific subclasses.
comment: AgentInfluence provides additional descriptions of an Agent's binary influence upon any other kind of resource. Instances of AgentInfluence use the prov:agent property to cite the influencing Agent.
subclass of: Influence
category: qualified
editors definition: AgentInfluence is the capacity of an agent to have an effect on the character, development, or behavior of another by means of attribution, association, delegation, or other.

Association
comment: An instance of prov:Association provides additional descriptions about the binary prov:wasAssociatedWith relation from an prov:Activity to some prov:Agent that had some responsiblity for it. For example, :baking prov:wasAssociatedWith :baker; prov:qualifiedAssociation [ a prov:Association; prov:agent :baker; :foo :bar ].
type: Class
subclass of: AgentInfluence
category: qualified
component: agents-responsibility
definition: An activity association is an assignment of responsibility to an agent for an activity, indicating that the agent had a role in the activity. It further allows for a plan to be specified, which is the plan intended by the agent to achieve some goals in the context of this activity.
dm: http://www.w3.org/TR/2013/REC-prov-dm-20130430/#term-Association
n: http://www.w3.org/TR/2013/REC-prov-n-20130430/#expression-Association
unqualified form: wasAssociatedWith

Attribution
comment: An instance of prov:Attribution provides additional descriptions about the binary prov:wasAttributedTo relation from an prov:Entity to some prov:Agent that had some responsible for it. For example, :cake prov:wasAttributedTo :baker; prov:qualifiedAttribution [ a prov:Attribution; prov:entity :baker; :foo :bar ].
type: Class
subclass of: AgentInfluence
category: qualified
component: agents-responsibility
constraints: http://www.w3.org/TR/2013/REC-prov-constraints-20130430/#prov-dm-constraints-fig
definition: Attribution is the ascribing of an entity to an agent. When an entity e is attributed to agent ag, entity e was generated by some unspecified activity that in turn was associated to agent ag. Thus, this relation is useful when the activity is not known, or irrelevant.
dm: http://www.w3.org/TR/2013/REC-prov-dm-20130430/#term-attribution
unqualified form: wasAttributedTo
n: http://www.w3.org/TR/2013/REC-prov-n-20130430/#expression-attribution

Bundle
comment: Note that there are kinds of bundles (e.g. handwritten letters, audio recordings, etc.) that are not expressed in PROV-O, but can be still be described by PROV-O.
type: Class
subclass of: Entity
category: expanded
definition: A bundle is a named set of provenance descriptions, and is itself an Entity, so allowing provenance of provenance to be expressed.
dm: http://www.w3.org/TR/2013/REC-prov-dm-20130430/#term-bundle-entity
n: http://www.w3.org/TR/2013/REC-prov-n-20130430/#expression-bundle-declaration

Collection
type: Class
subclass of: Entity
category: expanded
definition: A collection is an entity that provides a structure to some constituents, which are themselves entities. These constituents are said to be member of the collections.
component: collections
dm: http://www.w3.org/TR/2013/REC-prov-dm-20130430/#term-collection

Communication
type: Class
comment: An instance of prov:Communication provides additional descriptions about the binary prov:wasInformedBy relation from an informed prov:Activity to the prov:Activity that informed it. For example, :you_jumping_off_bridge prov:wasInformedBy :everyone_else_jumping_off_bridge; prov:qualifiedCommunication [ a prov:Communication; prov:activity :everyone_else_jumping_off_bridge; :foo :bar ].
subclass of: ActivityInfluence
category: qualified
component: entities-activities
constraints: http://www.w3.org/TR/2013/REC-prov-constraints-20130430/#prov-dm-constraints-fig
definition: Communication is the exchange of an entity by two activities, one activity using the entity generated by the other.
dm: http://www.w3.org/TR/2013/REC-prov-dm-20130430/#term-Communication
n: http://www.w3.org/TR/2013/REC-prov-n-20130430/#expression-wasInformedBy
unqualified form: wasInformedBy

Delegation
type: Class
comment: An instance of prov:Delegation provides additional descriptions about the binary prov:actedOnBehalfOf relation from a performing prov:Agent to some prov:Agent for whom it was performed. For example, :mixing prov:wasAssociatedWith :toddler . :toddler prov:actedOnBehalfOf :mother; prov:qualifiedDelegation [ a prov:Delegation; prov:entity :mother; :foo :bar ].
subclass of: AgentInfluence
component: agents-responsibility
category: qualified
definition: Delegation is the assignment of authority and responsibility to an agent (by itself or by another agent) to carry out a specific activity as a delegate or representative, while the agent it acts on behalf of retains some responsibility for the outcome of the delegated work. For example, a student acted on behalf of his supervisor, who acted on behalf of the department chair, who acted on behalf of the university; all those agents are responsible in some way for the activity that took place but we do not say explicitly who bears responsibility and to what degree.
dm: http://www.w3.org/TR/2013/REC-prov-dm-20130430/#term-delegation
n: http://www.w3.org/TR/2013/REC-prov-n-20130430/#expression-delegation
unqualified form: actedOnBehalfOf

Derivation
comment: An instance of prov:Derivation provides additional descriptions about the binary prov:wasDerivedFrom relation from some derived prov:Entity to another prov:Entity from which it was derived. For example, :chewed_bubble_gum prov:wasDerivedFrom :unwrapped_bubble_gum; prov:qualifiedDerivation [ a prov:Derivation; prov:entity :unwrapped_bubble_gum; :foo :bar ].
type: Class
comment: The more specific forms of prov:Derivation (i.e., prov:Revision, prov:Quotation, prov:PrimarySource) should be asserted if they apply.
subclass of: EntityInfluence
component: derivations
category: qualified
constraints: http://www.w3.org/TR/2013/REC-prov-constraints-20130430/#prov-dm-constraints-fig
definition: A derivation is a transformation of an entity into another, an update of an entity resulting in a new one, or the construction of a new entity based on a pre-existing entity.
dm: http://www.w3.org/TR/2013/REC-prov-dm-20130430/#term-Derivation
n: http://www.w3.org/TR/2013/REC-prov-n-20130430/#Derivation-Relation
unqualified form: wasDerivedFrom

EmptyCollection
type: Class
type: NamedIndividual
subclass of: Collection
category: expanded
component: collections
definition: An empty collection is a collection without members.

End
type: Class
comment: An instance of prov:End provides additional descriptions about the binary prov:wasEndedBy relation from some ended prov:Activity to an prov:Entity that ended it. For example, :ball_game prov:wasEndedBy :buzzer; prov:qualifiedEnd [ a prov:End; prov:entity :buzzer; :foo :bar; prov:atTime '2012-03-09T08:05:08-05:00'^^xsd:dateTime ].
subclass of: EntityInfluence
subclass of: InstantaneousEvent
category: qualified
constraints: http://www.w3.org/TR/2013/REC-prov-constraints-20130430/#prov-dm-constraints-fig
component: entities-activities
definition: End is when an activity is deemed to have been ended by an entity, known as trigger. The activity no longer exists after its end. Any usage, generation, or invalidation involving an activity precedes the activity's end. An end may refer to a trigger entity that terminated the activity, or to an activity, known as ender that generated the trigger.
dm: http://www.w3.org/TR/2013/REC-prov-dm-20130430/#term-End
unqualified form: wasEndedBy
n: http://www.w3.org/TR/2013/REC-prov-n-20130430/#expression-End

Entity
type: Class
disjointWith: InstantaneousEvent
category: starting-point
component: entities-activities
constraints: http://www.w3.org/TR/2013/REC-prov-constraints-20130430/#prov-dm-constraints-fig
definition: An entity is a physical, digital, conceptual, or other kind of thing with some fixed aspects; entities may be real or imaginary.
dm: http://www.w3.org/TR/2013/REC-prov-dm-20130430/#term-entity
n: http://www.w3.org/TR/2013/REC-prov-n-20130430/#expression-Entity

EntityInfluence
type: Class
comment: EntityInfluence provides additional descriptions of an Entity's binary influence upon any other kind of resource. Instances of EntityInfluence use the prov:entity property to cite the influencing Entity.
comment: It is not recommended that the type EntityInfluence be asserted without also asserting one of its more specific subclasses.
subclass of: Influence
category: qualified
editors definition: EntityInfluence is the capacity of an entity to have an effect on the character, development, or behavior of another by means of usage, start, end, derivation, or other.

Generation
type: Class
comment: An instance of prov:Generation provides additional descriptions about the binary prov:wasGeneratedBy relation from a generated prov:Entity to the prov:Activity that generated it. For example, :cake prov:wasGeneratedBy :baking; prov:qualifiedGeneration [ a prov:Generation; prov:activity :baking; :foo :bar ].
subclass of: ActivityInfluence
subclass of: InstantaneousEvent
category: qualified
component: entities-activities
constraints: http://www.w3.org/TR/2013/REC-prov-constraints-20130430/#prov-dm-constraints-fig
definition: Generation is the completion of production of a new entity by an activity. This entity did not exist before generation and becomes available for usage after this generation.
dm: http://www.w3.org/TR/2013/REC-prov-dm-20130430/#term-Generation
n: http://www.w3.org/TR/2013/REC-prov-n-20130430/#expression-Generation
unqualified form: wasGeneratedBy

Influence
type: Class
comment: An instance of prov:Influence provides additional descriptions about the binary prov:wasInfluencedBy relation from some influenced Activity, Entity, or Agent to the influencing Activity, Entity, or Agent. For example, :stomach_ache prov:wasInfluencedBy :spoon; prov:qualifiedInfluence [ a prov:Influence; prov:entity :spoon; :foo :bar ] . Because prov:Influence is a broad relation, the more specific relations (Communication, Delegation, End, etc.) should be used when applicable.
comment: Because prov:Influence is a broad relation, its most specific subclasses (e.g. prov:Communication, prov:Delegation, prov:End, prov:Revision, etc.) should be used when applicable.
category: qualified
component: derivations
definition: Influence is the capacity of an entity, activity, or agent to have an effect on the character, development, or behavior of another by means of usage, start, end, generation, invalidation, communication, derivation, attribution, association, or delegation.
dm: http://www.w3.org/TR/2013/REC-prov-dm-20130430/#term-influence
n: http://www.w3.org/TR/2013/REC-prov-n-20130430/#expression-influence
unqualified form: wasInfluencedBy

InstantaneousEvent
type: Class
comment: An instantaneous event, or event for short, happens in the world and marks a change in the world, in its activities and in its entities. The term 'event' is commonly used in process algebra with a similar meaning. Events represent communications or interactions; they are assumed to be atomic and instantaneous.
category: qualified
component: entities-activities
constraints: http://www.w3.org/TR/2013/REC-prov-constraints-20130430/#dfn-event
definition: The PROV data model is implicitly based on a notion of instantaneous events (or just events), that mark transitions in the world. Events include generation, usage, or invalidation of entities, as well as starting or ending of activities. This notion of event is not first-class in the data model, but it is useful for explaining its other concepts and its semantics.

Invalidation
type: Class
comment: An instance of prov:Invalidation provides additional descriptions about the binary prov:wasInvalidatedBy relation from an invalidated prov:Entity to the prov:Activity that invalidated it. For example, :uncracked_egg prov:wasInvalidatedBy :baking; prov:qualifiedInvalidation [ a prov:Invalidation; prov:activity :baking; :foo :bar ].
subclass of: ActivityInfluence
subclass of: InstantaneousEvent
category: qualified
component: entities-activities
constraints: http://www.w3.org/TR/2013/REC-prov-constraints-20130430/#prov-dm-constraints-fig
definition: Invalidation is the start of the destruction, cessation, or expiry of an existing entity by an activity. The entity is no longer available for use (or further invalidation) after invalidation. Any generation or usage of an entity precedes its invalidation.
dm: http://www.w3.org/TR/2013/REC-prov-dm-20130430/#term-Invalidation
n: http://www.w3.org/TR/2013/REC-prov-n-20130430/#expression-Invalidation
unqualified form: wasInvalidatedBy

Location
type: Class
category: expanded
definition: A location can be an identifiable geographic place (ISO 19112), but it can also be a non-geographic place such as a directory, row, or column. As such, there are numerous ways in which location can be expressed, such as by a coordinate, address, landmark, and so forth.
dm: http://www.w3.org/TR/2013/REC-prov-dm-20130430/#term-attribute-location
n: http://www.w3.org/TR/2013/REC-prov-n-20130430/#expression-attribute

Organization
type: Class
subclass of: Agent
category: expanded
component: agents-responsibility
definition: An organization is a social or legal institution such as a company, society, etc.
dm: http://www.w3.org/TR/2013/REC-prov-dm-20130430/#term-agent
n: http://www.w3.org/TR/2013/REC-prov-n-20130430/#expression-types

Person
type: Class
subclass of: Agent
category: expanded
component: agents-responsibility
definition: Person agents are people.
dm: http://www.w3.org/TR/2013/REC-prov-dm-20130430/#term-agent
n: http://www.w3.org/TR/2013/REC-prov-n-20130430/#expression-types

Plan
type: Class
comment: There exist no prescriptive requirement on the nature of plans, their representation, the actions or steps they consist of, or their intended goals. Since plans may evolve over time, it may become necessary to track their provenance, so plans themselves are entities. Representing the plan explicitly in the provenance can be useful for various tasks: for example, to validate the execution as represented in the provenance record, to manage expectation failures, or to provide explanations.
subclass of: Entity
category: expanded
category: qualified
component: agents-responsibility
definition: A plan is an entity that represents a set of actions or steps intended by one or more agents to achieve some goals.
dm: http://www.w3.org/TR/2013/REC-prov-dm-20130430/#term-Association
n: http://www.w3.org/TR/2013/REC-prov-n-20130430/#expression-Association

PrimarySource
type: Class
comment: An instance of prov:PrimarySource provides additional descriptions about the binary prov:hadPrimarySource relation from some secondary prov:Entity to an earlier, primary prov:Entity. For example, :blog prov:hadPrimarySource :newsArticle; prov:qualifiedPrimarySource [ a prov:PrimarySource; prov:entity :newsArticle; :foo :bar ] .
subclass of: Derivation
category: qualified
component: derivations
definition: A primary source for a topic refers to something produced by some agent with direct experience and knowledge about the topic, at the time of the topic's study, without benefit from hindsight. Because of the directness of primary sources, they 'speak for themselves' in ways that cannot be captured through the filter of secondary sources. As such, it is important for secondary sources to reference those primary sources from which they were derived, so that their reliability can be investigated. A primary source relation is a particular case of derivation of secondary materials from their primary sources. It is recognized that the determination of primary sources can be up to interpretation, and should be done according to conventions accepted within the application's domain.
dm: http://www.w3.org/TR/2013/REC-prov-dm-20130430/#term-primary-source
n: http://www.w3.org/TR/2013/REC-prov-n-20130430/#expression-original-source
unqualified form: hadPrimarySource

Quotation
type: Class
comment: An instance of prov:Quotation provides additional descriptions about the binary prov:wasQuotedFrom relation from some taken prov:Entity from an earlier, larger prov:Entity. For example, :here_is_looking_at_you_kid prov:wasQuotedFrom :casablanca_script; prov:qualifiedQuotation [ a prov:Quotation; prov:entity :casablanca_script; :foo :bar ].
subclass of: Derivation
category: qualified
component: derivations
definition: A quotation is the repeat of (some or all of) an entity, such as text or image, by someone who may or may not be its original author. Quotation is a particular case of derivation.
dm: http://www.w3.org/TR/2013/REC-prov-dm-20130430/#term-quotation
n: http://www.w3.org/TR/2013/REC-prov-n-20130430/#expression-quotation
unqualified form: wasQuotedFrom

Revision
type: Class
comment: An instance of prov:Revision provides additional descriptions about the binary prov:wasRevisionOf relation from some newer prov:Entity to an earlier prov:Entity. For example, :draft_2 prov:wasRevisionOf :draft_1; prov:qualifiedRevision [ a prov:Revision; prov:entity :draft_1; :foo :bar ].
subclass of: Derivation
category: qualified
component: derivations
definition: A revision is a derivation for which the resulting entity is a revised version of some original. The implication here is that the resulting entity contains substantial content from the original. Revision is a particular case of derivation.
dm: http://www.w3.org/TR/2013/REC-prov-dm-20130430/#term-revision
n: http://www.w3.org/TR/2013/REC-prov-n-20130430/#expression-Revision
unqualified form: wasRevisionOf

Role
type: Class
category: qualified
component: agents-responsibility
definition: A role is the function of an entity or agent with respect to an activity, in the context of a usage, generation, invalidation, association, start, and end.
dm: http://www.w3.org/TR/2013/REC-prov-dm-20130430/#term-attribute-role
n: http://www.w3.org/TR/2013/REC-prov-n-20130430/#expression-attribute

SoftwareAgent
type: Class
subclass of: Agent
category: expanded
component: agents-responsibility
definition: A software agent is running software.
dm: http://www.w3.org/TR/2013/REC-prov-dm-20130430/#term-agent
n: http://www.w3.org/TR/2013/REC-prov-n-20130430/#expression-types
subclass of: Thing
dm: http://www.w3.org/TR/2012/WD-prov-dm-20120703/prov-dm.html#term-agent
n: http://www.w3.org/TR/2012/WD-prov-dm-20120703/prov-n.html#expression-types

Start
comment: An instance of prov:Start provides additional descriptions about the binary prov:wasStartedBy relation from some started prov:Activity to an prov:Entity that started it. For example, :foot_race prov:wasStartedBy :bang; prov:qualifiedStart [ a prov:Start; prov:entity :bang; :foo :bar; prov:atTime '2012-03-09T08:05:08-05:00'^^xsd:dateTime ] .
type: Class
subclass of: EntityInfluence
subclass of: InstantaneousEvent
category: qualified
component: entities-activities
constraints: http://www.w3.org/TR/2013/REC-prov-constraints-20130430/#prov-dm-constraints-fig
definition: Start is when an activity is deemed to have been started by an entity, known as trigger. The activity did not exist before its start. Any usage, generation, or invalidation involving an activity follows the activity's start. A start may refer to a trigger entity that set off the activity, or to an activity, known as starter, that generated the trigger.
dm: http://www.w3.org/TR/2013/REC-prov-dm-20130430/#term-Start
n: http://www.w3.org/TR/2013/REC-prov-n-20130430/#expression-Start
unqualified form: wasStartedBy

Usage
comment: An instance of prov:Usage provides additional descriptions about the binary prov:used relation from some prov:Activity to an prov:Entity that it used. For example, :keynote prov:used :podium; prov:qualifiedUsage [ a prov:Usage; prov:entity :podium; :foo :bar ].
type: Class
subclass of: EntityInfluence
subclass of: InstantaneousEvent
category: qualified
constraints: http://www.w3.org/TR/2013/REC-prov-constraints-20130430/#prov-dm-constraints-fig
component: entities-activities
definition: Usage is the beginning of utilizing an entity by an activity. Before usage, the activity had not begun to utilize this entity and could not have been affected by the entity.
dm: http://www.w3.org/TR/2013/REC-prov-dm-20130430/#term-Usage
n: http://www.w3.org/TR/2013/REC-prov-n-20130430/#expression-Usage
unqualified form: used

actedOnBehalfOf
type: ObjectProperty
comment: An object property to express the accountability of an agent towards another agent. The subordinate agent acted on behalf of the responsible agent in an actual activity.
domain: Agent
range: Agent
subPropertyOf: wasInfluencedBy
propertyChainAxiom: qualifiedDelegation
propertyChainAxiom: agent
category: starting-point
component: agents-responsibility
inverse: hadDelegate
qualified form: Delegation
qualified form: qualifiedDelegation

activity
type: ObjectProperty
domain: ActivityInfluence
range: Activity
subPropertyOf: influencer
category: qualified
editorial note: This property behaves in spirit like rdf:object; it references the object of a prov:wasInfluencedBy triple.
editors definition: The prov:activity property references an prov:Activity which influenced a resource. This property applies to an prov:ActivityInfluence, which is given by a subproperty of prov:qualifiedInfluence from the influenced prov:Entity, prov:Activity or prov:Agent.
inverse: activityOfInfluence

agent
type: ObjectProperty
domain: AgentInfluence
range: Agent
subPropertyOf: influencer
category: qualified
editorial note: This property behaves in spirit like rdf:object; it references the object of a prov:wasInfluencedBy triple.
editors definition: The prov:agent property references an prov:Agent which influenced a resource. This property applies to an prov:AgentInfluence, which is given by a subproperty of prov:qualifiedInfluence from the influenced prov:Entity, prov:Activity or prov:Agent.
inverse: agentOfInfluence

alternateOf
type: ObjectProperty
domain: Entity
range: Entity
category: expanded
component: alternate
constraints: http://www.w3.org/TR/2013/REC-prov-constraints-20130430/#prov-dm-constraints-fig
definition: Two alternate entities present aspects of the same thing. These aspects may be the same or different, and the alternate entities may or may not overlap in time.
dm: http://www.w3.org/TR/2013/REC-prov-dm-20130430/#term-alternate
inverse: alternateOf
n: http://www.w3.org/TR/2013/REC-prov-n-20130430/#expression-alternate

atLocation
type: ObjectProperty
comment: The Location of any resource.
comment: This property has multiple RDFS domains to suit multiple OWL Profiles. See PROV-O OWL Profile.
domain: Class
  unionOf: Activity
  unionOf: Agent
  unionOf: Entity
  unionOf: InstantaneousEvent
range: Location
category: expanded
editorial note: The naming of prov:atLocation parallels prov:atTime, and is not named prov:hadLocation to avoid conflicting with the convention that prov:had* properties are used on prov:Influence classes.
editorial note: This property is not functional because the many values could be at a variety of granularies (In this building, in this room, in that chair).
inverse: locationOf
shares definition with: Location

atTime
comment: The time at which an InstantaneousEvent occurred, in the form of xsd:dateTime.
type: DatatypeProperty
domain: InstantaneousEvent
range: dateTime
category: qualified
component: entities-activities
shares definition with: InstantaneousEvent
unqualified form: endedAtTime
unqualified form: generatedAtTime
unqualified form: startedAtTime
unqualified form: invalidatedAtTime

category
comment: Classify prov-o terms into three categories, including 'starting-point', 'qualifed', and 'extended'. This classification is used by the prov-o html document to gently introduce prov-o terms to its users.
type: AnnotationProperty

component
type: AnnotationProperty
comment: Classify prov-o terms into six components according to prov-dm, including 'agents-responsibility', 'alternate', 'annotations', 'collections', 'derivations', and 'entities-activities'. This classification is used so that readers of prov-o specification can find its correspondence with the prov-dm specification.

constraints
comment: A reference to the principal section of the PROV-CONSTRAINTS document that describes this concept.
type: AnnotationProperty
subPropertyOf: seeAlso

definition
comment: A definition quoted from PROV-DM or PROV-CONSTRAINTS that describes the concept expressed with this OWL term.
type: AnnotationProperty

dm
type: AnnotationProperty
comment: A reference to the principal section of the PROV-DM document that describes this concept.
subPropertyOf: seeAlso

editorialNote
type: AnnotationProperty
comment: A note by the OWL development team about how this term expresses the PROV-DM concept, or how it should be used in context of semantic web or linked data.

editorsDefinition
type: AnnotationProperty
comment: When the prov-o term does not have a definition drawn from prov-dm, and the prov-o editor provides one.
subPropertyOf: definition

endedAtTime
comment: The time at which an activity ended. See also prov:startedAtTime.
type: DatatypeProperty
domain: Activity
range: dateTime
category: starting-point
component: entities-activities
editorial note: It is the intent that the property chain holds: (prov:qualifiedEnd o prov:atTime) rdfs:subPropertyOf prov:endedAtTime.
qualified form: End
qualified form: atTime

entity
type: ObjectProperty
domain: EntityInfluence
range: Entity
subPropertyOf: influencer
category: qualified
editors definition: The prov:entity property references an prov:Entity which influenced a resource. This property applies to an prov:EntityInfluence, which is given by a subproperty of prov:qualifiedInfluence from the influenced prov:Entity, prov:Activity or prov:Agent.
inverse: entityOfInfluence
editorial note: This property behaves in spirit like rdf:object; it references the object of a prov:wasInfluencedBy triple.

generated
type: ObjectProperty
domain: Activity
range: Entity
subPropertyOf: influenced
inverseOf: wasGeneratedBy
category: expanded
component: entities-activities
editorial note: prov:generated is one of few inverse property defined, to allow Activity-oriented assertions in addition to Entity-oriented assertions.
inverse: wasGeneratedBy
shares definition with: Generation

generatedAtTime
type: DatatypeProperty
comment: The time at which an entity was completely created and is available for use.
domain: Entity
range: dateTime
category: expanded
component: entities-activities
editorial note: It is the intent that the property chain holds: (prov:qualifiedGeneration o prov:atTime) rdfs:subPropertyOf prov:generatedAtTime.
qualified form: Generation
qualified form: atTime

hadActivity
type: ObjectProperty
comment: The _optional_ Activity of an Influence, which used, generated, invalidated, or was the responsibility of some Entity. This property is _not_ used by ActivityInfluence (use prov:activity instead).
comment: This property has multiple RDFS domains to suit multiple OWL Profiles. See PROV-O OWL Profile.
domain: Influence
domain: Class
  unionOf: Delegation
  unionOf: Derivation
  unionOf: End
  unionOf: Start
range: Activity
category: qualified
component: derivations
editorial note: The multiple rdfs:domain assertions are intended. One is simpler and works for OWL-RL, the union is more specific but is not recognized by OWL-RL.
inverse: wasActivityOfInfluence
shares definition with: Activity

hadGeneration
type: ObjectProperty
comment: The _optional_ Generation involved in an Entity's Derivation.
domain: Derivation
range: Generation
category: qualified
component: derivations
inverse: generatedAsDerivation
shares definition with: Generation

hadMember
type: ObjectProperty
domain: Collection
range: Entity
subPropertyOf: wasInfluencedBy
category: expanded
component: expanded
inverse: wasMemberOf
shares definition with: Collection

hadPlan
type: ObjectProperty
comment: The _optional_ Plan adopted by an Agent in Association with some Activity. Plan specifications are out of the scope of this specification.
domain: Association
range: Plan
category: qualified
component: agents-responsibility
inverse: wasPlanOf
shares definition with: Plan

hadPrimarySource
type: ObjectProperty
domain: Entity
range: Entity
subPropertyOf: wasDerivedFrom
propertyChainAxiom: qualifiedPrimarySource
propertyChainAxiom: entity
category: expanded
component: derivations
inverse: wasPrimarySourceOf
qualified form: PrimarySource
qualified form: qualifiedPrimarySource

hadRole
type: ObjectProperty
comment: The _optional_ Role that an Entity assumed in the context of an Activity. For example, :baking prov:used :spoon; prov:qualified [ a prov:Usage; prov:entity :spoon; prov:hadRole roles:mixing_implement ].
comment: This property has multiple RDFS domains to suit multiple OWL Profiles. See PROV-O OWL Profile.
domain: Influence
domain: Class
  unionOf: Association
  unionOf: InstantaneousEvent
range: Role
category: qualified
component: agents-responsibility
editors definition: prov:hadRole references the Role (i.e. the function of an entity with respect to an activity), in the context of an instantaneous usage, generation, association, start, and end.
inverse: wasRoleIn
shares definition with: Role

hadUsage
type: ObjectProperty
comment: The _optional_ Usage involved in an Entity's Derivation.
domain: Derivation
range: Usage
category: qualified
component: derivations
inverse: wasUsedInDerivation
shares definition with: Usage

influenced
type: ObjectProperty
inverseOf: wasInfluencedBy
category: expanded
component: agents-responsibility
inverse: wasInfluencedBy
shares definition with: Influence

influencer
type: ObjectProperty
comment: Subproperties of prov:influencer are used to cite the object of an unqualified PROV-O triple whose predicate is a subproperty of prov:wasInfluencedBy (e.g. prov:used, prov:wasGeneratedBy). prov:influencer is used much like rdf:object is used.
domain: Influence
range: Thing
category: qualified
dm: http://www.w3.org/TR/2013/REC-prov-dm-20130430/#term-influence
editorial note: This property and its subproperties are used in the same way as the rdf:object property, i.e. to reference the object of an unqualified prov:wasInfluencedBy or prov:influenced triple.
editors definition: This property is used as part of the qualified influence pattern. Subclasses of prov:Influence use these subproperties to reference the resource (Entity, Agent, or Activity) whose influence is being qualified.
inverse: hadInfluence

invalidated
type: ObjectProperty
domain: Activity
range: Entity
subPropertyOf: influenced
inverseOf: wasInvalidatedBy
category: expanded
component: entities-activities
editorial note: prov:invalidated is one of few inverse property defined, to allow Activity-oriented assertions in addition to Entity-oriented assertions.
inverse: wasInvalidatedBy
shares definition with: Invalidation

invalidatedAtTime
type: DatatypeProperty
comment: The time at which an entity was invalidated (i.e., no longer usable).
domain: Entity
range: dateTime
category: expanded
component: entities-activities
editorial note: It is the intent that the property chain holds: (prov:qualifiedInvalidation o prov:atTime) rdfs:subPropertyOf prov:invalidatedAtTime.
qualified form: Invalidation
qualified form: atTime

inverse
type: AnnotationProperty
comment: PROV-O does not define all property inverses. The directionalities defined in PROV-O should be given preference over those not defined. However, if users wish to name the inverse of a PROV-O property, the local name given by prov:inverse should be used.

http://www.w3.org/ns/prov#n
type: AnnotationProperty
comment: A reference to the principal section of the PROV-DM document that describes this concept.
subPropertyOf: seeAlso
comment: A reference to the principal section of the PROV-M document that describes this concept.

order
type: AnnotationProperty
comment: The position that this OWL term should be listed within documentation. The scope of the documentation (e.g., among all terms, among terms within a prov:category, among properties applying to a particular class, etc.) is unspecified.

qualifiedAssociation
type: ObjectProperty
comment: If this Activity prov:wasAssociatedWith Agent :ag, then it can qualify the Association using prov:qualifiedAssociation [ a prov:Association; prov:agent :ag; :foo :bar ].
domain: Activity
range: Association
subPropertyOf: qualifiedInfluence
category: qualified
component: agents-responsibility
inverse: qualifiedAssociationOf
shares definition with: Association
unqualified form: wasAssociatedWith

qualifiedAttribution
type: ObjectProperty
comment: If this Entity prov:wasAttributedTo Agent :ag, then it can qualify how it was influenced using prov:qualifiedAttribution [ a prov:Attribution; prov:agent :ag; :foo :bar ].
domain: Entity
range: Attribution
subPropertyOf: qualifiedInfluence
category: qualified
component: agents-responsibility
inverse: qualifiedAttributionOf
shares definition with: Attribution
unqualified form: wasAttributedTo

qualifiedCommunication
type: ObjectProperty
comment: If this Activity prov:wasInformedBy Activity :a, then it can qualify how it was influenced using prov:qualifiedCommunication [ a prov:Communication; prov:activity :a; :foo :bar ].
domain: Activity
range: Communication
subPropertyOf: qualifiedInfluence
category: qualified
component: entities-activities
inverse: qualifiedCommunicationOf
qualified form: Communication
shares definition with: Communication

qualifiedDelegation
type: ObjectProperty
comment: If this Agent prov:actedOnBehalfOf Agent :ag, then it can qualify how with prov:qualifiedResponsibility [ a prov:Responsibility; prov:agent :ag; :foo :bar ].
domain: Agent
range: Delegation
subPropertyOf: qualifiedInfluence
category: qualified
component: agents-responsibility
inverse: qualifiedDelegationOf
shares definition with: Delegation
unqualified form: actedOnBehalfOf

qualifiedDerivation
type: ObjectProperty
comment: If this Entity prov:wasDerivedFrom Entity :e, then it can qualify how it was derived using prov:qualifiedDerivation [ a prov:Derivation; prov:entity :e; :foo :bar ].
domain: Entity
range: Derivation
subPropertyOf: qualifiedInfluence
category: qualified
component: derivations
inverse: qualifiedDerivationOf
shares definition with: Derivation
unqualified form: wasDerivedFrom

qualifiedEnd
type: ObjectProperty
comment: If this Activity prov:wasEndedBy Entity :e1, then it can qualify how it was ended using prov:qualifiedEnd [ a prov:End; prov:entity :e1; :foo :bar ].
domain: Activity
range: End
subPropertyOf: qualifiedInfluence
category: qualified
component: entities-activities
inverse: qualifiedEndOf
shares definition with: End
unqualified form: wasEndedBy

qualifiedForm
type: AnnotationProperty
comment: This annotation property links a subproperty of prov:wasInfluencedBy with the subclass of prov:Influence and the qualifying property that are used to qualify it. Example annotation: prov:wasGeneratedBy prov:qualifiedForm prov:qualifiedGeneration, prov:Generation . Then this unqualified assertion: :entity1 prov:wasGeneratedBy :activity1 . can be qualified by adding: :entity1 prov:qualifiedGeneration :entity1Gen . :entity1Gen a prov:Generation, prov:Influence; prov:activity :activity1; :customValue 1337 . Note how the value of the unqualified influence (prov:wasGeneratedBy :activity1) is mirrored as the value of the prov:activity (or prov:entity, or prov:agent) property on the influence class.
subPropertyOf: seeAlso

qualifiedGeneration
type: ObjectProperty
comment: If this Activity prov:generated Entity :e, then it can qualify how it performed the Generation using prov:qualifiedGeneration [ a prov:Generation; prov:entity :e; :foo :bar ].
domain: Entity
range: Generation
subPropertyOf: qualifiedInfluence
category: qualified
component: entities-activities
inverse: qualifiedGenerationOf
shares definition with: Generation
unqualified form: wasGeneratedBy

qualifiedInfluence
type: ObjectProperty
comment: Because prov:qualifiedInfluence is a broad relation, the more specific relations (qualifiedCommunication, qualifiedDelegation, qualifiedEnd, etc.) should be used when applicable.
domain: Class
  unionOf: Activity
  unionOf: Agent
  unionOf: Entity
range: Influence
category: qualified
component: derivations
inverse: qualifiedInfluenceOf
shares definition with: Influence
unqualified form: wasInfluencedBy

qualifiedInvalidation
type: ObjectProperty
comment: If this Entity prov:wasInvalidatedBy Activity :a, then it can qualify how it was invalidated using prov:qualifiedInvalidation [ a prov:Invalidation; prov:activity :a; :foo :bar ].
domain: Entity
range: Invalidation
subPropertyOf: qualifiedInfluence
category: qualified
component: entities-activities
inverse: qualifiedInvalidationOf
shares definition with: Invalidation
unqualified form: wasInvalidatedBy

qualifiedPrimarySource
type: ObjectProperty
comment: If this Entity prov:hadPrimarySource Entity :e, then it can qualify how using prov:qualifiedPrimarySource [ a prov:PrimarySource; prov:entity :e; :foo :bar ].
domain: Entity
range: PrimarySource
subPropertyOf: qualifiedInfluence
category: qualified
component: derivations
inverse: qualifiedSourceOf
shares definition with: PrimarySource
unqualified form: hadPrimarySource

qualifiedQuotation
type: ObjectProperty
comment: If this Entity prov:wasQuotedFrom Entity :e, then it can qualify how using prov:qualifiedQuotation [ a prov:Quotation; prov:entity :e; :foo :bar ].
domain: Entity
range: Quotation
subPropertyOf: qualifiedInfluence
category: qualified
component: derivations
inverse: qualifiedQuotationOf
shares definition with: Quotation
unqualified form: wasQuotedFrom

qualifiedRevision
type: ObjectProperty
comment: If this Entity prov:wasRevisionOf Entity :e, then it can qualify how it was revised using prov:qualifiedRevision [ a prov:Revision; prov:entity :e; :foo :bar ].
domain: Entity
range: Revision
subPropertyOf: qualifiedInfluence
category: qualified
component: derivations
inverse: revisedEntity
shares definition with: Revision
unqualified form: wasRevisionOf

qualifiedStart
type: ObjectProperty
comment: If this Activity prov:wasStartedBy Entity :e1, then it can qualify how it was started using prov:qualifiedStart [ a prov:Start; prov:entity :e1; :foo :bar ].
domain: Activity
range: Start
subPropertyOf: qualifiedInfluence
category: qualified
component: entities-activities
inverse: qualifiedStartOf
shares definition with: Start
unqualified form: wasStartedBy

qualifiedUsage
type: ObjectProperty
comment: If this Activity prov:used Entity :e, then it can qualify how it used it using prov:qualifiedUsage [ a prov:Usage; prov:entity :e; :foo :bar ].
domain: Activity
range: Usage
subPropertyOf: qualifiedInfluence
category: qualified
component: entities-activities
inverse: qualifiedUsingActivity
shares definition with: Usage
unqualified form: used

specializationOf
type: AnnotationProperty
type: ObjectProperty
domain: Entity
range: Entity
subPropertyOf: alternateOf
category: expanded
component: alternate
constraints: http://www.w3.org/TR/2013/REC-prov-constraints-20130430/#prov-dm-constraints-fig
definition: An entity that is a specialization of another shares all aspects of the latter, and additionally presents more specific aspects of the same thing as the latter. In particular, the lifetime of the entity being specialized contains that of any specialization. Examples of aspects include a time period, an abstraction, and a context associated with the entity.
dm: http://www.w3.org/TR/2013/REC-prov-dm-20130430/#term-specialization
n: http://www.w3.org/TR/2013/REC-prov-n-20130430/#expression-specialization
inverse: generalizationOf
subPropertyOf: topObjectProperty
constraints: http://www.w3.org/TR/2012/WD-prov-dm-20120703/prov-constraints.html#prov-dm-constraints-fig
dm: http://www.w3.org/TR/2012/WD-prov-dm-20120703/prov-dm.html#term-specialization
n: http://www.w3.org/TR/2012/WD-prov-dm-20120703/prov-n.html#expression-specialization

startedAtTime
type: DatatypeProperty
comment: The time at which an activity started. See also prov:endedAtTime.
domain: Activity
range: dateTime
category: starting-point
component: entities-activities
editorial note: It is the intent that the property chain holds: (prov:qualifiedStart o prov:atTime) rdfs:subPropertyOf prov:startedAtTime.
qualified form: Start
qualified form: atTime

unqualifiedForm
type: AnnotationProperty
comment: Classes and properties used to qualify relationships are annotated with prov:unqualifiedForm to indicate the property used to assert an unqualified provenance relation.
subPropertyOf: seeAlso

used
type: ObjectProperty
comment: A prov:Entity that was used by this prov:Activity. For example, :baking prov:used :spoon, :egg, :oven .
domain: Activity
range: Entity
subPropertyOf: wasInfluencedBy
propertyChainAxiom: qualifiedUsage
propertyChainAxiom: entity
category: starting-point
component: entities-activities
inverse: wasUsedBy
qualified form: Usage
qualified form: qualifiedUsage

value
type: DatatypeProperty
domain: Entity
category: expanded
component: entities-activities
definition: Provides a value that is a direct representation of an entity.
dm: http://www.w3.org/TR/2013/REC-prov-dm-20130430/#term-attribute-value
editorial note: The editor's definition comes from http://www.w3.org/TR/rdf-primer/#rdfvalue
editorial note: This property serves the same purpose as rdf:value, but has been reintroduced to avoid some of the definitional ambiguity in the RDF specification (specifically, 'may be used in describing structured values').

wasAssociatedWith
type: ObjectProperty
comment: An prov:Agent that had some (unspecified) responsibility for the occurrence of this prov:Activity.
domain: Activity
range: Agent
subPropertyOf: wasInfluencedBy
propertyChainAxiom: qualifiedAssociation
propertyChainAxiom: agent
category: starting-point
component: agents-responsibility
inverse: wasAssociateFor
qualified form: Association
qualified form: qualifiedAssociation

wasAttributedTo
type: ObjectProperty
comment: Attribution is the ascribing of an entity to an agent.
domain: Entity
range: Agent
subPropertyOf: wasInfluencedBy
propertyChainAxiom: qualifiedAttribution
propertyChainAxiom: agent
category: starting-point
component: agents-responsibility
definition: Attribution is the ascribing of an entity to an agent.
inverse: contributed
qualified form: Attribution
qualified form: qualifiedAttribution

wasDerivedFrom
type: ObjectProperty
comment: The more specific subproperties of prov:wasDerivedFrom (i.e., prov:wasQuotedFrom, prov:wasRevisionOf, prov:hadPrimarySource) should be used when applicable.
domain: Entity
range: Entity
subPropertyOf: wasInfluencedBy
propertyChainAxiom: qualifiedDerivation
propertyChainAxiom: entity
category: starting-point
component: derivations
definition: A derivation is a transformation of an entity into another, an update of an entity resulting in a new one, or the construction of a new entity based on a pre-existing entity.
inverse: hadDerivation
qualified form: Derivation
qualified form: qualifiedDerivation

wasEndedBy
type: ObjectProperty
comment: End is when an activity is deemed to have ended. An end may refer to an entity, known as trigger, that terminated the activity.
domain: Activity
range: Entity
subPropertyOf: wasInfluencedBy
propertyChainAxiom: qualifiedEnd
propertyChainAxiom: entity
category: expanded
component: entities-activities
inverse: ended
qualified form: End
qualified form: qualifiedEnd

wasGeneratedBy
range: Activity
subPropertyOf: wasInfluencedBy
propertyChainAxiom: qualifiedGeneration
propertyChainAxiom: activity
category: starting-point
component: entities-activities
inverse: generated
qualified form: Generation
qualified form: qualifiedGeneration
domain: Entity
type: ObjectProperty
inverseOf: generated

wasInfluencedBy
type: ObjectProperty
comment: Because prov:wasInfluencedBy is a broad relation, its more specific subproperties (e.g. prov:wasInformedBy, prov:actedOnBehalfOf, prov:wasEndedBy, etc.) should be used when applicable.
comment: This property has multiple RDFS domains to suit multiple OWL Profiles. See PROV-O OWL Profile.
domain: Class
  unionOf: Activity
  unionOf: Agent
  unionOf: Entity
range: Class
  unionOf: Activity
  unionOf: Agent
  unionOf: Entity
category: qualified
component: agents-responsibility
editorial note: The sub-properties of prov:wasInfluencedBy can be elaborated in more detail using the Qualification Pattern. For example, the binary relation :baking prov:used :spoon can be qualified by asserting :baking prov:qualifiedUsage [ a prov:Usage; prov:entity :spoon; prov:atLocation :kitchen ] . Subproperties of prov:wasInfluencedBy may also be asserted directly without being qualified. prov:wasInfluencedBy should not be used without also using one of its subproperties.
inverse: influenced
qualified form: Influence
qualified form: qualifiedInfluence
shares definition with: Influence
inverseOf: influenced

wasInformedBy
type: ObjectProperty
comment: An activity a2 is dependent on or informed by another activity a1, by way of some unspecified entity that is generated by a1 and used by a2.
domain: Activity
range: Activity
subPropertyOf: wasInfluencedBy
propertyChainAxiom: qualifiedCommunication
propertyChainAxiom: activity
category: starting-point
component: entities-activities
inverse: informed
qualified form: Communication
qualified form: qualifiedCommunication

wasInvalidatedBy
type: ObjectProperty
domain: Entity
range: Activity
subPropertyOf: wasInfluencedBy
propertyChainAxiom: qualifiedInvalidation
propertyChainAxiom: activity
category: expanded
component: entities-activities
inverse: invalidated
qualified form: Invalidation
qualified form: qualifiedInvalidation
inverseOf: invalidated

wasQuotedFrom
comment: An entity is derived from an original entity by copying, or 'quoting', some or all of it.
type: ObjectProperty
domain: Entity
range: Entity
subPropertyOf: wasDerivedFrom
propertyChainAxiom: qualifiedQuotation
propertyChainAxiom: entity
category: expanded
component: derivations
inverse: quotedAs
qualified form: Quotation
qualified form: qualifiedQuotation

wasRevisionOf
type: AnnotationProperty
type: ObjectProperty
comment: A revision is a derivation that revises an entity into a revised version.
domain: Entity
range: Entity
subPropertyOf: wasDerivedFrom
propertyChainAxiom: qualifiedRevision
propertyChainAxiom: entity
category: expanded
component: derivations
inverse: hadRevision
qualified form: Revision
qualified form: qualifiedRevision

wasStartedBy
type: ObjectProperty
comment: Start is when an activity is deemed to have started. A start may refer to an entity, known as trigger, that initiated the activity.
domain: Activity
range: Entity
subPropertyOf: wasInfluencedBy
propertyChainAxiom: qualifiedStart
propertyChainAxiom: entity
category: expanded
component: entities-activities
inverse: started
qualified form: Start
qualified form: qualifiedStart

W3C PROVenance Interchange Ontology (PROV-O)
type: Ontology
comment: This document is published by the Provenance Working Group (http://www.w3.org/2011/prov/wiki/Main_Page). If you wish to make comments regarding this document, please send them to public-prov-comments@w3.org (subscribe public-prov-comments-request@w3.org, archives http://lists.w3.org/Archives/Public/public-prov-comments/). All feedback is welcome.
versionIRI: prov-o-20130430
versionInfo: Recommendation version 2013-04-30
specializationOf: prov-o
wasRevisionOf: prov-o-20120312

Axiom
annotatedProperty: range
annotatedSource: hadMember
annotatedTarget: Entity
dm: http://www.w3.org/TR/2013/REC-prov-dm-20130430/#term-collection
comment: A collection is an entity that provides a structure to some constituents, which are themselves entities. These constituents are said to be member of the collections.

Axiom
comment: hadPrimarySource property is a particular case of wasDerivedFrom (see http://www.w3.org/TR/prov-dm/#term-original-source) that aims to give credit to the source that originated some information.
annotatedProperty: subPropertyOf
annotatedSource: hadPrimarySource
annotatedTarget: wasDerivedFrom

Axiom
comment: Attribution is a particular case of trace (see http://www.w3.org/TR/prov-dm/#concept-trace), in the sense that it links an entity to the agent that ascribed it.
annotatedProperty: subPropertyOf
annotatedSource: wasAttributedTo
annotatedTarget: wasInfluencedBy
definition: IF wasAttributedTo(e2,ag1,aAttr) holds, THEN wasInfluencedBy(e2,ag1) also holds.

Axiom
comment: Derivation is a particular case of trace (see http://www.w3.org/TR/prov-dm/#term-trace), since it links an entity to another entity that contributed to its existence.
annotatedProperty: subPropertyOf
annotatedSource: wasDerivedFrom
annotatedTarget: wasInfluencedBy

Axiom
annotatedProperty: range
annotatedSource: wasInfluencedBy
annotatedTarget: Class
  unionOf: Activity
  unionOf: Agent
  unionOf: Entity
definition: influencer: an identifier (o1) for an ancestor entity, activity, or agent that the former depends on;
dm: http://www.w3.org/TR/2013/REC-prov-dm-20130430/#term-influence

Axiom
annotatedProperty: domain
annotatedSource: wasInfluencedBy
annotatedTarget: Class
  unionOf: Activity
  unionOf: Agent
  unionOf: Entity
definition: influencee: an identifier (o2) for an entity, activity, or agent;
dm: http://www.w3.org/TR/2013/REC-prov-dm-20130430/#term-influence

Axiom
comment: Quotation is a particular case of derivation (see http://www.w3.org/TR/prov-dm/#term-quotation) in which an entity is derived from an original entity by copying, or "quoting", some or all of it.
annotatedProperty: subPropertyOf
annotatedSource: wasQuotedFrom
annotatedTarget: wasDerivedFrom

Axiom
comment: Revision is a derivation (see http://www.w3.org/TR/prov-dm/#term-Revision). Moreover, according to http://www.w3.org/TR/2013/REC-prov-constraints-20130430/#term-Revision 23 April 2012 'wasRevisionOf is a strict sub-relation of wasDerivedFrom since two entities e2 and e1 may satisfy wasDerivedFrom(e2,e1) without being a variant of each other.'
annotatedProperty: subPropertyOf
annotatedSource: wasRevisionOf
annotatedTarget: wasDerivedFrom

hadDelegate
inverseOf: actedOnBehalfOf

activityOfInfluence
inverseOf: activity

agentOfInfluence
inverseOf: agent

locationOf
inverseOf: atLocation

entityOfInfluence
inverseOf: entity

wasActivityOfInfluence
inverseOf: hadActivity

generatedAsDerivation
inverseOf: hadGeneration

wasMemberOf
inverseOf: hadMember

wasPlanOf
inverseOf: hadPlan

wasPrimarySourceOf
inverseOf: hadPrimarySource

wasRoleIn
inverseOf: hadRole

wasUsedInDerivation
inverseOf: hadUsage

hadInfluence
inverseOf: influencer

qualifiedAssociationOf
inverseOf: qualifiedAssociation

qualifiedAttributionOf
inverseOf: qualifiedAttribution

qualifiedCommunicationOf
inverseOf: qualifiedCommunication

qualifiedDelegationOf
inverseOf: qualifiedDelegation

qualifiedDerivationOf
inverseOf: qualifiedDerivation

qualifiedEndOf
inverseOf: qualifiedEnd

qualifiedGenerationOf
inverseOf: qualifiedGeneration

qualifiedInfluenceOf
inverseOf: qualifiedInfluence

qualifiedInvalidationOf
inverseOf: qualifiedInvalidation

qualifiedSourceOf
inverseOf: qualifiedPrimarySource

qualifiedQuotationOf
inverseOf: qualifiedQuotation

revisedEntity
inverseOf: qualifiedRevision

qualifiedStartOf
inverseOf: qualifiedStart

qualifiedUsingActivity
inverseOf: qualifiedUsage

generalizationOf
inverseOf: specializationOf

wasUsedBy
inverseOf: used

wasAssociateFor
inverseOf: wasAssociatedWith

contributed
inverseOf: wasAttributedTo

hadDerivation
inverseOf: wasDerivedFrom

ended
inverseOf: wasEndedBy

informed
inverseOf: wasInformedBy

quotedAs
inverseOf: wasQuotedFrom

hadRevision
inverseOf: wasRevisionOf

started
inverseOf: wasStartedBy

PROV Access and Query Ontology
type: Ontology
comment: 0.2
comment: This document is published by the Provenance Working Group (http://www.w3.org/2011/prov/wiki/Main_Page). If you wish to make comments regarding this document, please send them to public-prov-comments@w3.org (subscribe public-prov-comments-request@w3.org, archives http://lists.w3.org/Archives/Public/public-prov-comments/). All feedback is welcome.
versionIRI: NOTE-prov-aq-20130430

ServiceDescription
type: Class
comment: Type for a generic provenance query service. Mainly for use in RDF provenance query service descriptions, to facilitate discovery in linked data environments.
subclass of: SoftwareAgent
aq: http://www.w3.org/TR/2013/NOTE-prov-aq-20130430/#provenance-query-service-discovery
category: access-and-query

ProvenanceService
type: Class
comment: Type for a generic provenance query service. Mainly for use in RDF provenance query service descriptions, to facilitate discovery in linked data environments.
subclass of: SoftwareAgent
aq: http://www.w3.org/TR/2013/NOTE-prov-aq-20130430/#provenance-query-service-discovery
category: access-and-query

has_anchor
type: ObjectProperty
comment: Indicates anchor URI for a potentially dynamic resource instance.
aq: http://www.w3.org/TR/2013/NOTE-prov-aq-20130430/#resource-represented-as-html
category: access-and-query
inverse: anchorOf

has_provenance
type: ObjectProperty
comment: Indicates a provenance-URI for a resource; the resource identified by this property presents a provenance record about its subject or anchor resource.
aq: http://www.w3.org/TR/2013/NOTE-prov-aq-20130430/#resource-represented-as-html
category: access-and-query
inverse: provenanceOf

hasProvenanceService
comment: Indicates a provenance query service that can access provenance related to its subject or anchor resource.
type: ObjectProperty
aq: http://www.w3.org/TR/2013/NOTE-prov-aq-20130430/
category: access-and-query
inverse: provenanceQueryServiceOf

describesService
type: ObjectProperty
comment: relates a generic provenance query service resource (type prov:ServiceDescription) to a specific query service description (e.g. a prov:DirectQueryService or a sd:Service).
aq: http://www.w3.org/TR/2013/NOTE-prov-aq-20130430/rovenance-query-service-description
category: access-and-query
inverse: serviceDescribedBy

provenanceUriTemplate
comment: Relates a provenance service to a URI template string for constructing provenance-URIs.
type: DatatypeProperty
aq: http://www.w3.org/TR/2013/NOTE-prov-aq-20130430/
category: access-and-query

provenance pingback
type: ObjectProperty
comment: Relates a resource to a provenance pingback service that may receive additional provenance links about the resource.
aq: http://www.w3.org/TR/2013/NOTE-prov-aq-20130430/#provenance-pingback
category: access-and-query

Dublin Core extensions of the W3C PROVenance Interchange Ontology (PROV-O)
type: Ontology
comment: This document is published by the Provenance Working Group (http://www.w3.org/2011/prov/wiki/Main_Page). If you wish to make comments regarding this document, please send them to public-prov-comments@w3.org (subscribe public-prov-comments-request@w3.org, archives http://lists.w3.org/Archives/Public/public-prov-comments/). All feedback is welcome.
imports: W3C PROVenance Interchange Ontology (PROV-O)

Accept
type: Class
subclass of: Activity
definition: Activity that identifies the acceptance of a resource (e.g., an article in a conference)

Contribute
type: Class
subclass of: Activity
definition: Activity that identifies any contribution of an agent to a resource.

Contributor
type: Class
subclass of: Role
definition: Role with the function of having responsibility for making contributions to a resource. The Agent assigned to this role is associated with a Modify or Create Activities

Copyright
type: Class
subclass of: Activity
definition: Activity that identifies the Copyrighting activity associated to a resource.

Create
type: Class
definition: Activity that identifies the creation of a resource
subclass of: Contribute

Creator
type: Class
subclass of: Contributor
definition: Role with the function of creating a resource. The Agent assigned to this role is associated with a Create Activity

Modify
type: Class
subclass of: Activity
definition: Activity that identifies the modification of a resource.

Publish
type: Class
subclass of: Activity
definition: Activity that identifies the publication of a resource

Publisher
type: Class
subclass of: Role
definition: Role with the function of publishing a resource. The Agent assigned to this role is associated with a Publish Activity

Replace
type: Class
subclass of: Activity
definition: Activity that identifies the replacement of a resource.

RightsAssignment
type: Class
subclass of: Activity
definition: Activity that identifies the rights assignment of a resource.

RightsHolder
type: Class
subclass of: Role
definition: Role with the function of owning or managing rights over a resource. The Agent assigned to this role is associated with a RightsAssignment Activity

Submit
type: Class
subclass of: Activity
definition: Activity that identifies the issuance (e.g., publication) of a resource.

W3C PROVenance Interchange Ontology (PROV-O) Dictionary Extension
type: Ontology
comment: This document is published by the Provenance Working Group (http://www.w3.org/2011/prov/wiki/Main_Page). If you wish to make comments regarding this document, please send them to public-prov-comments@w3.org (subscribe public-prov-comments-request@w3.org, archives http://lists.w3.org/Archives/Public/public-prov-comments/). All feedback is welcome.

Dictionary
type: Class
definition: A dictionary is an entity that provides a structure to some constituents, which are themselves entities. These constituents are said to be member of the dictionary.
comment: This concept allows for the provenance of the dictionary, but also of its constituents to be expressed. Such a notion of dictionary corresponds to a wide variety of concrete data structures, such as a maps or associative arrays.
comment: A given dictionary forms a given structure for its members. A different structure (obtained either by insertion or removal of members) constitutes a different dictionary.
category: collections
dm: http://www.w3.org/TR/2013/NOTE-prov-dictionary-20130430/#dictionary-conceptual-definition
component: collections
n: http://www.w3.org/TR/2013/NOTE-prov-dictionary-20130430/#expression-dictionary
constraints: http://www.w3.org/TR/2013/NOTE-prov-dictionary-20130430/#dictionary-constraints

Empty Dictionary
type: Class
definition: An empty dictionary (i.e. has no members).
subclass of: EmptyCollection
subclass of: Dictionary
component: collections
category: collections
dm: http://www.w3.org/TR/2013/NOTE-prov-dictionary-20130430/#dictionary-conceptual-definition
constraints: http://www.w3.org/TR/2013/NOTE-prov-dictionary-20130430/#dictionary-constraints
n: http://www.w3.org/TR/2013/NOTE-prov-dictionary-20130430/#expression-dictionary

Key-Entity Pair
type: Class
definition: A key-entity pair. Part of a prov:Dictionary through prov:hadDictionaryMember. The key is any RDF Literal, the value is a prov:Entity.
subclass of: Restriction
  onProperty: pairKey
  cardinality: 1
subclass of: Restriction
  onProperty: pairKey
  cardinality: 1
category: collections
component: collections
dm: http://www.w3.org/TR/2013/NOTE-prov-dictionary-20130430/#term-dictionary-membership
n: http://www.w3.org/TR/2013/NOTE-prov-dictionary-20130430/#expression-dictionary-membership
constraints: http://www.w3.org/TR/2013/NOTE-prov-dictionary-20130430/#dictionary-constraints

Insertion
type: Class
definition: Insertion is a derivation that transforms a dictionary into another, by insertion of one or more key-entity pairs.
subclass of: Derivation
subclass of: Restriction
  onProperty: dictionary
  cardinality: 1
subclass of: Restriction
  onProperty: insertedKeyEntityPair
  minCardinality: 1
category: collections
component: collections
dm: http://www.w3.org/TR/2013/NOTE-prov-dictionary-20130430/#term-dictionary-insertion
n: http://www.w3.org/TR/2013/NOTE-prov-dictionary-20130430/#expression-dictionary-insertion
constraints: http://www.w3.org/TR/2013/NOTE-prov-dictionary-20130430/#dictionary-constraints
unqualified form: derivedByInsertionFrom

Removal
type: Class
definition: Removal is a derivation that transforms a dictionary into another, by removing one or more key-entity pairs.
subclass of: Derivation
subclass of: Restriction
  onProperty: dictionary
  cardinality: 1
subclass of: Restriction
  onProperty: removedKey
  minCardinality: 1
component: collections
category: collections
dm: http://www.w3.org/TR/2013/NOTE-prov-dictionary-20130430/#term-dictionary-removal
n: http://www.w3.org/TR/2013/NOTE-prov-dictionary-20130430/#expression-dictionary-removal
constraints: http://www.w3.org/TR/2013/NOTE-prov-dictionary-20130430/#dictionary-constraints
unqualified form: derivedByRemovalFrom

dictionary
type: ObjectProperty
definition: The property used by a prov:Insertion and prov:Removal to cite the prov:Dictionary that was prov:derivedByInsertionFrom or prov:derivedByRemovalFrom another dictionary.
subPropertyOf: entity
domain: Insertion
domain: Removal
range: Dictionary
category: collections
component: collections
dm: http://www.w3.org/TR/2013/NOTE-prov-dictionary-20130430/#term-dictionary-insertion
dm: http://www.w3.org/TR/2013/NOTE-prov-dictionary-20130430/#term-dictionary-removal
n: http://www.w3.org/TR/2013/NOTE-prov-dictionary-20130430/#expression-dictionary-insertion
n: http://www.w3.org/TR/2013/NOTE-prov-dictionary-20130430/#expression-dictionary-removal
constraints: http://www.w3.org/TR/2013/NOTE-prov-dictionary-20130430/#dictionary-constraints

derivedByInsertionFrom
type: ObjectProperty
definition: The dictionary was derived from the other by insertion. prov:qualifiedInsertion shows details of the insertion, in particular the inserted key-entity pairs.
subPropertyOf: wasDerivedFrom
domain: Dictionary
range: Dictionary
category: collections
component: collections
dm: http://www.w3.org/TR/2013/NOTE-prov-dictionary-20130430/#term-dictionary-insertion
n: http://www.w3.org/TR/2013/NOTE-prov-dictionary-20130430/#expression-dictionary-insertion
constraints: http://www.w3.org/TR/2013/NOTE-prov-dictionary-20130430/#dictionary-constraints

derivedByRemovalFrom
type: ObjectProperty
domain: Dictionary
range: Dictionary
category: collections
component: collections
dm: http://www.w3.org/TR/2013/NOTE-prov-dictionary-20130430/#term-dictionary-removal
definition: The dictionary was derived from the other by removal. prov:qualifiedRemoval shows details of the removal, in particular the removed key-entity pairs.
n: http://www.w3.org/TR/2013/NOTE-prov-dictionary-20130430/#expression-dictionary-removal
subPropertyOf: wasDerivedFrom
constraints: http://www.w3.org/TR/2013/NOTE-prov-dictionary-20130430/#dictionary-constraints

insertedKeyEntityPair
type: ObjectProperty
definition: An object property to refer to the prov:KeyEntityPair inserted into a prov:Dictionary.
domain: Insertion
range: Key-Entity Pair
category: collections
component: collections
dm: http://www.w3.org/TR/2013/NOTE-prov-dictionary-20130430/#term-dictionary-insertion
n: http://www.w3.org/TR/2013/NOTE-prov-dictionary-20130430/#expression-dictionary-insertion
constraints: http://www.w3.org/TR/2013/NOTE-prov-dictionary-20130430/#dictionary-constraints

hadDictionaryMember
type: ObjectProperty
definition: Describes the key-entity pair that was member of a prov:Dictionary. A dictionary can have multiple members.
range: Key-Entity Pair
domain: Dictionary
category: collections
component: collections
dm: http://www.w3.org/TR/2013/NOTE-prov-dictionary-20130430/#term-dictionary-membership
n: http://www.w3.org/TR/2013/NOTE-prov-dictionary-20130430/#expression-dictionary-membership
constraints: http://www.w3.org/TR/2013/NOTE-prov-dictionary-20130430/#dictionary-constraints

pairKey
type: DatatypeProperty
type: FunctionalProperty
definition: The key of a KeyEntityPair, which is an element of a prov:Dictionary.
domain: Key-Entity Pair
range: Literal
category: collections
component: collections
dm: http://www.w3.org/TR/2013/NOTE-prov-dictionary-20130430/#term-dictionary-membership
n: http://www.w3.org/TR/2013/NOTE-prov-dictionary-20130430/#expression-dictionary-membership
constraints: http://www.w3.org/TR/2013/NOTE-prov-dictionary-20130430/#dictionary-constraints

pairKey
type: ObjectProperty
type: FunctionalProperty
definition: The value of a KeyEntityPair.
domain: Key-Entity Pair
range: Entity
category: collections
component: collections
dm: http://www.w3.org/TR/2013/NOTE-prov-dictionary-20130430/#term-dictionary-membership
n: http://www.w3.org/TR/2013/NOTE-prov-dictionary-20130430/#expression-dictionary-membership
constraints: http://www.w3.org/TR/2013/NOTE-prov-dictionary-20130430/#dictionary-constraints

qualifiedInsertion
type: ObjectProperty
definition: The dictionary was derived from the other by insertion. prov:qualifiedInsertion shows details of the insertion, in particular the inserted key-entity pairs.
subPropertyOf: qualifiedDerivation
domain: Dictionary
range: Insertion
category: collections
component: collections
n: http://www.w3.org/TR/2013/NOTE-prov-dictionary-20130430/#expression-dictionary-insertion
constraints: http://www.w3.org/TR/2013/NOTE-prov-dictionary-20130430/#dictionary-constraints
dm: http://www.w3.org/TR/2013/NOTE-prov-dictionary-20130430/#term-dictionary-insertion

qualifiedRemoval
type: ObjectProperty
definition: The dictionary was derived from the other by removal. prov:qualifiedRemoval shows details of the removal, in particular the removed keys.
subPropertyOf: qualifiedDerivation
domain: Dictionary
range: Removal
category: collections
component: collections
dm: http://www.w3.org/TR/2013/NOTE-prov-dictionary-20130430/#term-dictionary-removal
n: http://www.w3.org/TR/2013/NOTE-prov-dictionary-20130430/#expression-dictionary-removal
constraints: http://www.w3.org/TR/2013/NOTE-prov-dictionary-20130430/#dictionary-constraints

removedKey
type: DatatypeProperty
definition: The key removed in a Removal.
domain: Removal
range: Literal
category: collections
component: collections
dm: http://www.w3.org/TR/2013/NOTE-prov-dictionary-20130430/#term-dictionary-removal
n: http://www.w3.org/TR/2013/NOTE-prov-dictionary-20130430/#expression-dictionary-removal
constraints: http://www.w3.org/TR/2013/NOTE-prov-dictionary-20130430/#dictionary-constraints

W3C PROV Linking Across Provenance Bundles Ontology (PROV-LINKS)
type: Ontology
imports: W3C PROVenance Interchange Ontology (PROV-O)
comment: This document is published by the Provenance Working Group (http://www.w3.org/2011/prov/wiki/Main_Page). If you wish to make comments regarding this document, please send them to public-prov-comments@w3.org (subscribe public-prov-comments-request@w3.org, archives http://lists.w3.org/Archives/Public/public-prov-comments/ ). All feedback is welcome.
versionIRI: prov-links-20130430
versionInfo: Working Group Note version 2013-04-30
specializationOf: prov-links

asInBundle
type: ObjectProperty
comment: prov:asInBundle is used to specify which bundle the general entity of a prov:mentionOf property is described. When :x prov:mentionOf :y and :y is described in Bundle :b, the triple :x prov:asInBundle :b is also asserted to cite the Bundle in which :y was described.
domain: Entity
range: Bundle
inverse: contextOf
shares definition with: mentionOf

mentionOf
type: ObjectProperty
comment: prov:mentionOf is used to specialize an entity as described in another bundle. It is to be used in conjuction with prov:asInBundle. prov:asInBundle is used to cite the Bundle in which the generalization was mentioned.
domain: Entity
range: Entity
subPropertyOf: specializationOf
inverse: hadMention

foundation
type: Property

Friend of a Friend (FOAF) vocabulary
type: Ontology
description: The Friend of a Friend (FOAF) RDF vocabulary, described using W3C RDF Schema and the Web Ontology Language.

Agent
type: Class
comment: An agent (eg. person, group, software or physical artifact).
equivalentClass: Agent
term status: stable

Document
type: Class
comment: A document.
disjointWith: Organization
disjointWith: Project
term status: testing

Organization
type: Class
comment: An organization.
subclass of: Agent
disjointWith: Person
disjointWith: Document
term status: stable

Project
type: Class
comment: A project (a collective endeavour of some kind).
disjointWith: Person
disjointWith: Document
term status: testing

Group
type: Class
comment: A class of Agents.
subclass of: Agent
term status: stable

Image
type: Class
comment: An image.
subclass of: Document
term status: testing

Label Property
type: Class
comment: A foaf:LabelProperty is any RDF property with texual values that serve as labels.
term status: unstable

Online Account
type: Class
comment: An online account.
subclass of: Thing
term status: testing

Online Chat Account
type: Class
comment: An online chat account.
subclass of: Online Account
term status: unstable

Online E-commerce Account
type: Class
comment: An online e-commerce account.
subclass of: Online Account
term status: unstable

Online Gaming Account
type: Class
comment: An online gaming account.
subclass of: Online Account
term status: unstable

Person
type: Class
comment: A person.
subclass of: Agent
subclass of: Person
subclass of: SpatialThing
disjointWith: Organization
disjointWith: Project
term status: stable

PersonalProfileDocument
type: Class
comment: A personal profile RDF document.
subclass of: Document
term status: testing

account
type: Property
type: ObjectProperty
comment: Indicates an account held by this agent.
domain: Agent
range: Online Account
term status: testing

account name
type: Property
type: DatatypeProperty
domain: Online Account
range: Literal
term status: testing
comment: Indicates the name (identifier) associated with this online account.

account service homepage
type: Property
type: ObjectProperty
comment: Indicates a homepage of the service provide for this online account.
domain: Online Account
range: Document
term status: testing

age
type: Property
type: FunctionalProperty
type: DatatypeProperty
comment: The age in years of some agent.
domain: Agent
range: Literal
term status: unstable

AIM chat ID
type: Property
type: DatatypeProperty
type: InverseFunctionalProperty
comment: An AIM chat ID
domain: Agent
range: Literal
subPropertyOf: nickname
term status: testing

nickname
type: Property
type: DatatypeProperty
comment: A short informal nickname characterising an agent (includes login identifiers, IRC and other chat nicknames).
term status: testing

based near
type: Property
type: ObjectProperty
comment: A location that something is based near, for some broadly human notion of near.
domain: SpatialThing
range: SpatialThing
term status: testing

birthday
type: Property
type: FunctionalProperty
comment: The birthday of this Agent, represented in mm-dd string form, eg. '12-31'.
type: DatatypeProperty
domain: Agent
range: Literal
term status: unstable

current project
type: ObjectProperty
comment: A current project this person works on.
domain: Person
range: Thing
term status: testing
type: Property

depiction
type: Property
type: ObjectProperty
comment: A depiction of some thing.
domain: Thing
range: Image
inverseOf: depicts
term status: testing

depicts
type: Property
type: ObjectProperty
comment: A thing depicted in this representation.
domain: Image
range: Thing
inverseOf: depiction
term status: testing

DNA checksum
type: Property
type: DatatypeProperty
comment: A checksum for the DNA of some thing. Joke.
range: Literal
term status: archaic

familyName
type: Property
type: DatatypeProperty
comment: The family name of some person.
domain: Person
range: Literal
term status: testing

family_name
type: Property
type: DatatypeProperty
comment: The family name of some person.
domain: Person
range: Literal
term status: archaic

firstName
type: Property
type: DatatypeProperty
comment: The first name of a person.
domain: Person
range: Literal
term status: testing

focus
type: Property
type: ObjectProperty
comment: The underlying or 'focal' entity associated with some SKOS-described concept.
domain: Concept
range: Thing
term status: testing

funded by
type: Property
comment: An organization funding a project or person.
domain: Thing
range: Thing
term status: archaic
type: ObjectProperty

geekcode
type: Property
type: DatatypeProperty
domain: Person
range: Literal
term status: archaic
comment: A textual geekcode for this person, see http://www.geekcode.com/geek.html

gender
type: Property
type: FunctionalProperty
type: DatatypeProperty
comment: The gender of this Agent (typically but not necessarily 'male' or 'female').
domain: Agent
range: Literal
term status: testing

Given name
type: Property
type: DatatypeProperty
comment: The given name of some person.
term status: testing

Given name
type: Property
type: DatatypeProperty
comment: The given name of some person.
term status: archaic

account
type: Property
type: ObjectProperty
comment: Indicates an account held by this agent.
domain: Agent
range: Online Account
term status: archaic

homepage
type: Property
type: ObjectProperty
type: InverseFunctionalProperty
comment: A homepage for some thing.
domain: Thing
range: Document
subPropertyOf: page
subPropertyOf: is primary topic of
term status: stable

page
type: Property
type: ObjectProperty
domain: Thing
range: Document
inverseOf: topic
term status: testing
comment: A page or document about this thing.

is primary topic of
type: Property
type: InverseFunctionalProperty
comment: A document that this thing is the primary topic of.
domain: Thing
range: Document
subPropertyOf: page
inverseOf: primary topic
term status: stable

ICQ chat ID
type: Property
type: DatatypeProperty
type: InverseFunctionalProperty
comment: An ICQ chat ID
domain: Agent
range: Literal
subPropertyOf: nickname
term status: testing

image
type: Property
type: ObjectProperty
comment: An image that can be used to represent some thing (ie. those depictions which are particularly representative of something, eg. one's photo on a homepage).
domain: Person
range: Image
subPropertyOf: depiction
term status: testing

interest
type: Property
type: ObjectProperty
comment: A page about a topic of interest to this person.
domain: Agent
range: Document
term status: testing

primary topic
type: Property
type: FunctionalProperty
type: ObjectProperty
comment: The primary topic of some page or document.
domain: Document
range: Thing
inverseOf: is primary topic of
term status: stable

jabber ID
type: Property
type: DatatypeProperty
type: InverseFunctionalProperty
comment: A jabber ID for something.
domain: Agent
range: Literal
term status: testing

knows
type: Property
type: ObjectProperty
comment: A person known by this person (indicating some level of reciprocated interaction between the parties).
domain: Person
range: Person
term status: stable

lastName
type: Property
comment: The last name of a person.
range: Literal
term status: testing
type: DatatypeProperty
domain: Person

logo
type: Property
type: ObjectProperty
type: InverseFunctionalProperty
comment: A logo representing some thing.
domain: Thing
range: Thing
term status: testing

made
type: Property
type: ObjectProperty
comment: Something that was made by this agent.
domain: Agent
range: Thing
inverseOf: maker
term status: stable

maker
type: Property
type: ObjectProperty
comment: An agent that made this thing.
domain: Thing
range: Agent
equivalentProperty: Creator
inverseOf: made
term status: stable

personal mailbox
type: Property
type: InverseFunctionalProperty
type: ObjectProperty
comment: A personal mailbox, ie. an Internet mailbox associated with exactly one owner, the first owner of this mailbox. This is a 'static inverse functional property', in that there is (across time and change) at most one individual that ever has any particular value for foaf:mbox.
domain: Agent
range: Thing
term status: stable

sha1sum of a personal mailbox URI name
type: Property
type: InverseFunctionalProperty
type: DatatypeProperty
domain: Agent
comment: The sha1sum of the URI of an Internet mailbox associated with exactly one owner, the first owner of the mailbox.
range: Literal
term status: testing

member
type: Property
type: ObjectProperty
comment: Indicates a member of a Group
domain: Group
range: Agent
term status: stable

membershipClass
type: Property
type: AnnotationProperty
comment: Indicates the class of individuals that are a member of a Group
term status: unstable

MSN chat ID
type: Property
type: DatatypeProperty
type: InverseFunctionalProperty
comment: An MSN chat ID
domain: Agent
range: Literal
subPropertyOf: nickname
term status: testing

myersBriggs
type: Property
type: DatatypeProperty
comment: A Myers Briggs (MBTI) personality classification.
domain: Person
term status: testing
range: Literal

name
type: Property
type: DatatypeProperty
comment: A name for some thing.
domain: Thing
range: Literal
subPropertyOf: label
term status: testing

openid
type: Property
type: ObjectProperty
type: InverseFunctionalProperty
comment: An OpenID for an Agent.
domain: Agent
range: Document
subPropertyOf: is primary topic of
term status: testing

topic
type: Property
type: ObjectProperty
comment: A topic of some page or document.
domain: Document
range: Thing
inverseOf: page
term status: testing

past project
type: ObjectProperty
type: Property
comment: A project this person has previously worked on.
domain: Person
range: Thing
term status: testing

phone
type: Property
type: ObjectProperty
comment: A phone, specified using fully qualified tel: URI scheme (refs: http://www.w3.org/Addressing/schemes.html#tel).
term status: testing

plan
type: Property
type: DatatypeProperty
comment: A .plan comment, in the tradition of finger and '.plan' files.
domain: Person
range: Literal
term status: testing

publications
type: Property
type: ObjectProperty
domain: Person
comment: A link to the publications of this person.
range: Document
term status: testing

schoolHomepage
type: Property
type: ObjectProperty
domain: Person
comment: A homepage of a school attended by the person.
range: Document
term status: testing

sha1sum (hex)
type: Property
type: DatatypeProperty
domain: Document
term status: unstable
comment: A sha1sum hash, in hex.

Skype ID
type: Property
type: DatatypeProperty
comment: A Skype ID
domain: Agent
range: Literal
subPropertyOf: nickname
term status: testing

status
type: Property
type: DatatypeProperty
comment: A string expressing what the user is happy for the general public (normally) to know about their current activity.
domain: Agent
range: Literal
term status: unstable

Surname
type: Property
type: DatatypeProperty
comment: The surname of some person.
domain: Person
range: Literal
term status: archaic

theme
type: ObjectProperty
comment: A theme.
domain: Thing
range: Thing
term status: archaic
type: Property

thumbnail
type: Property
type: ObjectProperty
comment: A derived thumbnail image.
domain: Image
range: Image
term status: testing

tipjar
type: ObjectProperty
comment: A tipjar document for this agent, describing means for payment and reward.
type: Property
domain: Agent
range: Document
subPropertyOf: page
term status: testing

title
type: Property
comment: Title (Mr, Mrs, Ms, Dr. etc)
type: DatatypeProperty
term status: testing

topic_interest
type: Property
type: ObjectProperty
comment: A thing of interest to this person.
domain: Agent
range: Thing
term status: testing

weblog
type: Property
type: ObjectProperty
type: InverseFunctionalProperty
comment: A weblog of some thing (whether person, group, company etc.).
domain: Agent
range: Document
subPropertyOf: page
term status: testing

work info homepage
type: Property
type: ObjectProperty
domain: Person
range: Document
term status: testing
comment: A work info homepage of some person; a page about their work for some organization.

workplace homepage
type: Property
comment: A workplace homepage of some person; the homepage of an organization they work for.
type: ObjectProperty
domain: Person
term status: testing
range: Document

Yahoo chat ID
type: DatatypeProperty
type: InverseFunctionalProperty
comment: A Yahoo chat ID
domain: Agent
range: Literal
subPropertyOf: nickname
term status: testing
type: Property

The RDF Schema vocabulary (RDFS)
type: Ontology

Resource
type: Class
comment: The class resource, everything.

Class
comment: The class of classes.
subclass of: Resource

subClassOf
type: Property
comment: The subject is a subclass of a class.
range: Class
domain: Class

subPropertyOf
type: Property
comment: The subject is a subproperty of a property.
range: Property
domain: Property

domain
type: Property
range: Class
comment: A domain of the subject property.
domain: Property

range
range: Class
domain: Property
comment: A range of the subject property.
type: Property

Literal
type: Class
comment: The class of literal values, eg. textual strings and integers.
subclass of: Resource

Container
type: Class
subclass of: Resource
comment: The class of RDF containers.

ContainerMembershipProperty
type: Class
subclass of: Property
comment: The class of container membership properties, rdf:_1, rdf:_2, ..., all of which are sub-properties of 'member'.

member
type: Property
range: Resource
domain: Resource
comment: A member of the subject resource.

Datatype
type: Class
comment: The class of RDF datatypes.
subclass of: Class

organization
type: Item
label: organisasi @jv
label: antolakuntza @eu
label: organizacja @pl
label: Tantanakuy @qu
label: Organizacija @bs
label: organización @es
label: அமைப்பு @ta
label: pertubuhan @ms
label: organisatsioon @et
label: منظمة @ar
label: organisation
label: organisatie @nl
label: organização @pt
label: samtök @is
label: organizaĵo @eo
label: ארגאניזאציע @yi
label: Yayasan Kebudayaan Rancage @su
label: организация @ru
label: организација @sr
label: organizasyon @tr
label: ڕێکخراوە @ckb
label: organisaatio @fi
label: організація @uk
label: арганізацыя @be
label: සංවිධානය @si
label: organisasjon @nn
label: Тэрилтэ @sah
label: સંસ્થા @gu
label: organizuro @io
label: سازمان @mzn
label: Təşkilat @az
label: organizacija @hr
label: Organisasyon @tl
label: Ұйым @kk
label: 조직 @ko
label: ארגון @he
label: Àgbájọ @yo
label: organizācija @lv
label: organizzazione @it
label: Organisation @de
label: 組織 @ja
label: tổ chức @vi
label: संगठन @hi
label: องค์การ @th
label: organizație @ro
name: organització @ca
label: organizatio @la
label: organizace @cs
label: संस्था @mr
label: సంస్థ @te
label: ܛܘܟܣܐ @arc
label: អង្គភាព @km
label: szervezet @hu
label: Organisatschoon @nds
label: 组织 @zh-hans
label: ორგანიზაცია @ka
label: tashkilot @uz
label: Арганізацыя @be
label: organisasie @af
label: οργανισμός @el
label: സംഘടന @ml
label: প্রতিষ্ঠান @bn
label: organizacion @oc
label: Organisatie @vls
label: Organizaçon @mwl
label: nepali @ne
description: social entity with a collective goal
alternative label: org
OmegaWiki Defined Meaning: 4987
topic's main category: Category:Organizations
GND identifier: 4043774-7
PIJAS: 11274
subclass of: social group
subclass of: geographical object
Freebase identifier: /m/0qb7t
PSH ID: 8037
equivalent class: Organisation
influenced by: RMU
Commons category: Organizations

Organization
stylesheet: schemaorg.css
stylesheet: prettify.css
uses vocabulary: schema.org
type: Class
comment: An organization such as a school, NGO, corporation, club, etc.

address
type: Property
range includes: Text
range includes: PostalAddress
comment: Physical address of the item.

aggregateRating
type: Property
range includes: AggregateRating
comment: The overall rating, based on a collection of reviews or ratings, of the item.

alumni
type: Property
range includes: Person
comment: Alumni of an organization. Inverse property: alumniOf.

areaServed
type: Property
range includes: AdministrativeArea
range includes: Text
range includes: Place
range includes: GeoShape
comment: The geographic area where a service or offered item is provided. Supersedes serviceArea.

award
type: Property
range includes: Text
comment: An award won by or for this item. Supersedes awards.

brand
type: Property
range includes: Brand
range includes: Organization
comment: The brand(s) associated with a product or service, or the brand(s) maintained by an organization or business person.

contactPoint
type: Property
range includes: ContactPoint
comment: A contact point for a person or organization. Supersedes contactPoints.

department
type: Property
range includes: Organization
comment: A relationship between an organization and a department of that organization, also described as an organization (allowing different urls, logos, opening hours). For example: a store with a pharmacy, or a bakery with a cafe.

dissolutionDate
type: Property
range includes: Date
comment: The date that this organization was dissolved.

duns
type: Property
range includes: Text
comment: The Dun & Bradstreet DUNS number for identifying an organization or business person.

email
type: Property
range includes: Text
comment: Email address.

employee
type: Property
range includes: Person
comment: Someone working for this organization. Supersedes employees.

event
type: Property
range includes: Event
comment: Upcoming or past event associated with this place, organization, or action. Supersedes events.

faxNumber
type: Property
range includes: Text
comment: The fax number.

founder
type: Property
range includes: Person
comment: A person who founded this organization. Supersedes founders.

foundingDate
type: Property
range includes: Date
comment: The date that this organization was founded.

foundingLocation
type: Property
range includes: Place
comment: The place where the Organization was founded.

globalLocationNumber
type: Property
range includes: Text
comment: The Global Location Number (GLN, sometimes also referred to as International Location Number or ILN) of the respective organization, person, or place. The GLN is a 13-digit number used to identify parties and physical locations.

hasOfferCatalog
type: Property
range includes: OfferCatalog
comment: Indicates an OfferCatalog listing for this Organization, Person, or Service.

hasPOS
type: Property
range includes: Place
comment: Points-of-Sales operated by the organization or person.

isicV4
type: Property
range includes: Text
comment: The International Standard of Industrial Classification of All Economic Activities (ISIC), Revision 4 code for a particular organization, business person, or place.

legalName
type: Property
range includes: Text
comment: The official name of the organization, e.g. the registered company name.

location
type: Property
range includes: Place
range includes: Text
range includes: PostalAddress
comment: The location of for example where the event is happening, an organization is located, or where an action takes place.

logo
type: Property
range includes: URL
range includes: ImageObject
comment: An associated logo.

makesOffer
type: Property
range includes: Offer
comment: A pointer to products or services offered by the organization or person. Inverse property: offeredBy.

member
type: Property
range includes: Person
range includes: Organization
comment: A member of an Organization or a ProgramMembership. Organizations can be members of organizations; ProgramMembership is typically for individuals. Supersedes members, musicGroupMember. Inverse property: memberOf.

memberOf
type: Property
range includes: ProgramMembership
range includes: Organization
comment: An Organization (or ProgramMembership) to which this Person or Organization belongs. Inverse property: member.

naics
type: Property
range includes: Text
comment: The North American Industry Classification System (NAICS) code for a particular organization or business person.

numberOfEmployees
type: Property
range includes: QuantitativeValue
comment: The number of employees in an organization e.g. business.

owns
type: Property
range includes: Product
range includes: OwnershipInfo
comment: Products owned by the organization or person.

parentOrganization
type: Property
range includes: Organization
comment: The larger organization that this organization is a branch of, if any. Supersedes branchOf. Inverse property: subOrganization.

review
type: Property
range includes: Review
comment: A review of the item. Supersedes reviews.

seeks
type: Property
range includes: Demand
comment: A pointer to products or services sought by the organization or person (demand).

subOrganization
range includes: Organization
comment: A relationship between two organizations where the first includes the second, e.g., as a subsidiary. See also: the more specific 'department' property. Inverse property: parentOrganization.
type: Property

taxID
type: Property
range includes: Text
comment: The Tax / Fiscal ID of the organization or person, e.g. the TIN in the US or the CIF/NIF in Spain.

telephone
type: Property
range includes: Text
comment: The telephone number.

vatID
type: Property
range includes: Text
comment: The Value-added Tax ID of the organization or person.

additionalType
type: Property
range includes: URL
comment: An additional type for the item, typically used for adding more specific types from external vocabularies in microdata syntax. This is a relationship between something and a class that the thing is in. In RDFa syntax, it is better to use the native RDFa syntax - the 'typeof' attribute - for multiple types. Schema.org tools may have only weaker understanding of extra types, in particular those defined externally.

alternateName
type: Property
range includes: Text
comment: An alias for the item.

description
type: Property
range includes: Text
comment: A short description of the item.

image
type: Property
range includes: ImageObject
range includes: URL
comment: An image of the item. This can be a URL or a fully described ImageObject.

mainEntityOfPage
type: Property
range includes: URL
range includes: CreativeWork
comment: Indicates a page (or other CreativeWork) for which this thing is the main entity being described. See background notes for details. Inverse property: mainEntity.

name
type: Property
range includes: Text
comment: The name of the item.

potentialAction
type: Property
range includes: Action
comment: Indicates a potential Action, which describes an idealized action in which this thing would play an 'object' role.

sameAs
type: Property
range includes: URL
comment: URL of a reference Web page that unambiguously indicates the item's identity. E.g. the URL of the item's Wikipedia page, Freebase page, or official website.

url
type: Property
range includes: URL
comment: URL of the item.

组织 (社会学)
type: Article
about: organization
language: zh

Organisasi
type: Article
about: organization
language: jv

Antolakuntza
type: Article
about: organization
language: eu

Organizacja
type: Article
about: organization
language: pl

Tantanakuy
type: Article
about: organization
language: qu

Organizacija
type: Article
about: organization
language: bs

Organización
type: Article
about: organization
language: es

அமைப்பு
type: Article
about: organization
language: ta

Pertubuhan
type: Article
about: organization
language: ms

Organisatsioon
type: Article
about: organization
language: et

منظمة
type: Article
about: organization
language: ar

Organisation
type: Article
about: organization
language: sv

Organisatie
type: Article
about: organization
language: nl

Organização
type: Article
about: organization
language: pt

Samtök
type: Article
about: organization
language: is

Organizaĵo
type: Article
language: eo
about: organization

ארגאניזאציע
about: organization
language: yi
type: Article

Организација
type: Article
about: organization
language: sr

Kuruluş
type: Article
about: organization
language: tr

ڕێکخراوە
type: Article
about: organization
language: ckb

Организирање
type: Article
about: organization
language: mk

Organisaatio
type: Article
about: organization
language: fi

Організація
type: Article
about: organization
language: uk

Арганізацыя
type: Article
about: organization
language: be-tarask

සංවිධානය
type: Article
about: organization
language: si

Organisasjon
type: Article
language: nn
about: organization

Тэрилтэ
type: Article
about: organization
language: sah

સંસ્થા
type: Article
language: gu
about: organization

Organizuro
type: Article
about: organization
language: io

سازمان
type: Article
language: mzn
about: organization

Təşkilat
about: organization
language: az
type: Article

Organizacija
type: Article
about: organization
language: hr

Organisasyon
type: Article
about: organization
language: tl

Organisation
type: Article
about: organization
language: da

Organisasi
type: Article
about: organization
language: jv-x-bms

조직 (사회과학)
type: Article
about: organization
language: ko

Organisation
type: Article
about: organization
language: fr

ארגון
type: Article
about: organization
language: he

Арганізацыя
type: Article
language: be
about: organization

Àgbájọ
type: Article
about: organization
language: yo

Organizācija
type: Article
about: organization
language: lv

Organizzazione
type: Article
about: organization
language: it

Organización
type: Article
about: organization
language: gl

Organisation
type: Article
language: de
about: organization

Organisasi
type: Article
about: organization
language: id

組織 (社会科学)
type: Article
language: ja
about: organization

Organization
type: Article
about: organization
language: en-x-simple

Organizacija
type: Article
language: sh
about: organization

संगठन
type: Article
about: organization
language: hi

Organization
type: Article
about: organization
language: en

Organisasjon
type: Article
about: organization
language: nb

องค์การ
type: Article
about: organization
language: th

Organizație
type: Article
about: organization
language: ro

Entitat
type: Article
about: organization
language: ca

Organizatio
type: Article
about: organization
language: la

Organizacija
type: Article
about: organization
language: sl

Organizace
type: Article
about: organization
language: cs

سازمان
type: Article
about: organization
language: fa

संस्था
type: Article
about: organization
language: mr

Организация
type: Article
about: organization
language: bg

సంస్థ
type: Article
about: organization
language: te

ܛܘܟܣܐ
type: Article
about: organization
language: arc

Organizacija
type: Article
about: organization
language: lt

സംഘടന
type: Article
about: organization
language: ml

Organizaçon
type: Article
about: organization
language: mwl

Organizacion
type: Article
about: organization
language: oc

Organisasyon
type: Article
about: organization
language: war

Organization
type: Article
about: organization
language: en

Organizzazione
type: Article
about: organization
language: it

Organizasyon
type: Article
about: organization
language: diq

Tuddsa
type: Article
about: organization
language: kab

Կազմակերպություն
type: Article
about: organization
language: hy

Organisation
type: Article
about: organization
language: sco

ਜਥੇਬੰਦੀ
type: Article
about: organization
language: pa

組織
type: Article
about: organization
language: yue

Tổ chức
type: Article
about: organization
language: vi

Organizata
type: Article
about: organization
language: sq

location city
type: Property

Cervecería Centro Americana
type: Organization108008335
type: Thing
type: Organization
type: Agent
type: Group100031264
type: Organisation
type: Institution108053576
type: organization
type: SocialPerson
type: SocialGroup107950920
type: YagoLegalActor
type: YagoPermanentlyLocatedEntity
type: YagoLegalActorGeo
type: Company108058098
type: Abstraction100002137
type: Company
type: business
comment: Die Cervecería Centro Americana, S.A. (dt. „Zentralamerikanische Brauerei AG“) ist die größte Bierbrauerei Guatemalas und zählt zu den größten Mittelamerikas. Sie hat ihren Sitz in Guatemala-Stadt. @de
comment: Cervecería Centro Americana Sociedad Anónima is a Guatemalan brewery based in Guatemala City, Guatemala. It was founded by Mariano Castillo Córdova and his brother, Rafael Castillo Córdova.
name: Cervecería Centro Americana S.A.
subject: Category:Guatemala
wiki page ID: 2698460
subject: Category:Beer and breweries in Central America
wiki page revision ID: 641556326
homepage: http://www.cerveceriacentroamericana.com
foundation: 1886-02-03
industry: Drink
location: Guatemala
location: Guatemala City
type: Public company
has photo collection: Cervecería Centro Americana
wordnet type: synset-company-noun-1
products: Beer
type: Brewery

location
type: Property

DCMI Metadata Terms - other
Date Modified: 2012-06-14
publisher: DCMI

Agent
description: Examples of Agent include person, organization, and software agent.
Has Version: Agent-001
issued: 2008-01-14
type: Agent Class
type: Class
comment: A resource that acts or has the power to act.

Agent Class
description: Examples of Agent Class include groups seen as classes, such as students, women, charities, lecturers.
Has Version: AgentClass-003
issued: 2008-01-14
Date Modified: 2012-06-14
type: Class
comment: A group of agents.
subclass of: Class

Bibliographic Resource
Has Version: BibliographicResource-001
issued: 2008-01-14
type: Class
comment: A book, article, or other documentary resource.

DCMI Box
Has Version: Box-003
issued: 2000-07-11
Date Modified: 2008-01-14
type: Datatype
comment: The set of regions in space defined by their geographic coordinates according to the DCMI Box Encoding Scheme.

DCMI Type Vocabulary
Has Version: DCMIType-005
issued: 2000-07-11
Date Modified: 2012-06-14
type: VocabularyEncodingScheme
comment: The set of classes specified by the DCMI Type Vocabulary, used to categorize the nature or genre of the resource.

business
alternative label: business organisation
alternative label: business organization
alternative label: companies
alternative label: business firm
alternative label: firms
alternative label: businesses
alternative label: company
alternative label: business firms
alternative label: business concern
alternative label: enterprise
alternative label: business organizations
alternative label: business concerns
alternative label: firm
alternative label: business organisations
subclass of: Entities
subclass of: Organizations
subclass of: CommercialOrganization
subclass of: Container-Underspecified
subclass of: Institution
subclass of: Organization
definition: A specialization of CommercialOrganization (q.v.). Each instance of Business is an organization intended to make profits, i.e. to make money for agents who own them. Note that not all CommercialOrganizations are Businesses. For example, in a franchise Organization, while the parent company (see #$parentCompany) is regarded as a business, the sub-organizations are commercial organizations but not businesses. Also, Businesses are typically LegalAgents, while CommercialOrganizations need not be.
is related to: Business
type: Class
type: RefConcept
broader: ExistingObjectType
super class of: SportsFranchise
super class of: ChemicalPlant-Organization
super class of: HydroElectricEnergyCompany-Commercial
super class of: OilCompany
super class of: Company
super class of: ManufacturingCompany
super class of: PubliclyHeldCorporation
super class of: DryCleaningOrLaundry
super class of: IndependentBusiness
super class of: AutoDealership
super class of: TravelDiscounter-Business
super class of: LocalBusiness
super class of: CommercialFarmOrganization
super class of: HealthMaintenanceOrganization
super class of: ImportExportOrganization
super class of: LargeIncorporatedBusiness
super class of: TechnologyCompany
super class of: ConsultingFirm
super class of: USBusiness
super class of: BankingOrFinanceCompany
super class of: FossilFuelBurningEnergyCompany-Commercial
super class of: CommercialEnergyCompany
super class of: Cinema-Organization
super class of: GrainProcessingOrganization
super class of: RecordCompany
super class of: BiotechnologyCompany
super class of: ConstructionCompany
super class of: InAdministration
super class of: MajorCompany
super class of: SoftwareVendor
super class of: CommercialHoldingCompany
super class of: ServiceEstablishment
super class of: AirlineCompany
super class of: AutomotiveBusiness
super class of: HomeBusiness
super class of: Tannery-Organization
super class of: RealEstateFirm
super class of: LiveMusicVenue-Organization
super class of: AlternativeFuelEnergyCompany-Commercial
super class of: AnimalBreeder-Business
super class of: SmallBusiness
super class of: CurrencyExchangeCompany
narrower transitive: AirlineCompany
narrower transitive: AlternativeFuelEnergyCompany-Commercial
narrower transitive: AnimalBreeder-Business
narrower transitive: AutoDealership
narrower transitive: AutomotiveBusiness
narrower transitive: BankingOrFinanceCompany
narrower transitive: BiotechnologyCompany
narrower transitive: ChemicalPlant-Organization
narrower transitive: Cinema-Organization
narrower transitive: CommercialEnergyCompany
narrower transitive: CommercialFarmOrganization
narrower transitive: CommercialHoldingCompany

DDC
Has Version: DDC-003
issued: 2000-07-11
Date Modified: 2008-01-14
type: VocabularyEncodingScheme
comment: The set of conceptual resources specified by the Dewey Decimal Classification.

File Format
description: Examples include the formats defined by the list of Internet Media Types.
Has Version: FileFormat-001
issued: 2008-01-14
type: Class
comment: A digital resource format.
subclass of: Media Type

Frequency
Has Version: Frequency-001
issued: 2008-01-14
type: Class
comment: A rate at which something recurs.

IMT
Has Version: IMT-004
issued: 2000-07-11
Date Modified: 2008-01-14
type: VocabularyEncodingScheme
comment: The set of media types specified by the Internet Assigned Numbers Authority.

ISO 3166
Has Version: ISO3166-004
issued: 2000-07-11
Date Modified: 2008-01-14
type: Datatype
comment: The set of codes listed in ISO 3166-1 for the representation of names of countries.

ISO 639-2
Has Version: ISO639-2-003
issued: 2000-07-11
Date Modified: 2008-01-14
type: Datatype
comment: The three-letter alphabetic codes listed in ISO639-2 for the representation of names of languages.

ISO 639-3
Has Version: ISO639-3-001
issued: 2008-01-14
type: Datatype
comment: The set of three-letter codes listed in ISO 639-3 for the representation of names of languages.

Jurisdiction
Has Version: Jurisdiction-001
issued: 2008-01-14
type: Class
comment: The extent or range of judicial, law enforcement, or other authority.
subclass of: Location, Period, or Jurisdiction

LCC
Has Version: LCC-003
issued: 2000-07-11
Date Modified: 2008-01-14
type: VocabularyEncodingScheme
comment: The set of conceptual resources specified by the Library of Congress Classification.

LCSH
Has Version: LCSH-003
issued: 2000-07-11
Date Modified: 2008-01-14
type: VocabularyEncodingScheme
comment: The set of labeled concepts specified by the Library of Congress Subject Headings.

License Document
Has Version: LicenseDocument-001
issued: 2008-01-14
type: Class
comment: A legal document giving official permission to do something with a Resource.
subclass of: Rights Statement

Linguistic System
description: Examples include written, spoken, sign, and computer languages.
Has Version: LinguisticSystem-001
issued: 2008-01-14
type: Class
comment: A system of signs, symbols, sounds, gestures, or rules used in communication.

Location
Has Version: Location-001
issued: 2008-01-14
type: Class
comment: A spatial region or named place.
subclass of: Location, Period, or Jurisdiction

Location, Period, or Jurisdiction
Has Version: LocationPeriodOrJurisdiction-001
issued: 2008-01-14
type: Class
comment: A location, period of time, or jurisdiction.

MeSH
Has Version: MESH-003
issued: 2000-07-11
Date Modified: 2008-01-14
type: VocabularyEncodingScheme
comment: The set of labeled concepts specified by the Medical Subject Headings.

Media Type
Has Version: MediaType-001
issued: 2008-01-14
type: Class
comment: A file format or physical medium.
subclass of: Media Type or Extent

Media Type or Extent
Has Version: MediaTypeOrExtent-001
issued: 2008-01-14
type: Class
comment: A media type or extent.

Method of Accrual
issued: 2008-01-14
Has Version: MethodOfAccrual-001
comment: A method by which resources are added to a collection.
type: Class

Method of Instruction
Has Version: MethodOfInstruction-001
issued: 2008-01-14
comment: A process that is used to engender knowledge, attitudes, and skills.
type: Class

NLM
Date Modified: 2008-01-14
issued: 2005-06-13
comment: The set of conceptual resources specified by the National Library of Medicine Classification.
type: VocabularyEncodingScheme
Has Version: NLM-002

DCMI Period
Has Version: Period-003
Date Modified: 2008-01-14
issued: 2000-07-11
comment: The set of time intervals defined by their limits according to the DCMI Period Encoding Scheme.
type: Datatype

Period of Time
Has Version: PeriodOfTime-001
type: Class
issued: 2008-01-14
comment: An interval of time that is named or defined by its start and end dates.
subclass of: Location, Period, or Jurisdiction

Physical Medium
description: Examples include paper, canvas, or DVD.
Has Version: PhysicalMedium-001
issued: 2008-01-14
type: Class
comment: A physical material or carrier.
subclass of: Media Type

Physical Resource
Has Version: PhysicalResource-001
issued: 2008-01-14
type: Class
comment: A material thing.

DCMI Point
Has Version: Point-003
issued: 2000-07-11
Date Modified: 2008-01-14
type: Datatype
comment: The set of points in space defined by their geographic coordinates according to the DCMI Point Encoding Scheme.

Policy
Has Version: Policy-001
issued: 2008-01-14
type: Class
comment: A plan or course of action by an authority, intended to influence and determine decisions, actions, and other matters.

Provenance Statement
Has Version: ProvenanceStatement-001
issued: 2008-01-14
comment: A statement of any changes in ownership and custody of a resource since its creation that are significant for its authenticity, integrity, and interpretation.
type: Class

RFC 1766
Has Version: RFC1766-003
issued: 2000-07-11
Date Modified: 2008-01-14
type: Datatype
comment: The set of tags, constructed according to RFC 1766, for the identification of languages.

RFC 3066
Has Version: RFC3066-002
description: RFC 3066 has been obsoleted by RFC 4646.
issued: 2002-07-13
Date Modified: 2008-01-14
type: Datatype
comment: The set of tags constructed according to RFC 3066 for the identification of languages.

RFC 4646
description: RFC 4646 obsoletes RFC 3066.
Has Version: RFC4646-001
issued: 2008-01-14
type: Datatype
comment: The set of tags constructed according to RFC 4646 for the identification of languages.

RFC 5646
description: RFC 5646 obsoletes RFC 4646.
Has Version: RFC5646-001
issued: 2010-10-11
comment: The set of tags constructed according to RFC 5646 for the identification of languages.
type: Datatype

Rights Statement
Has Version: RightsStatement-001
issued: 2008-01-14
type: Class
comment: A statement about the intellectual property rights (IPR) held in or over a Resource, a legal document giving official permission to do something with a resource, or a statement about access rights.

Size or Duration
description: Examples include a number of pages, a specification of length, width, and breadth, or a period in hours, minutes, and seconds.
Has Version: SizeOrDuration-001
issued: 2008-01-14
type: Class
comment: A dimension or extent, or a time taken to play or execute.
subclass of: Media Type or Extent

Standard
issued: 2008-01-14
Has Version: Standard-001
comment: A basis for comparison; a reference point against which other things can be evaluated.
type: Class

TGN
Has Version: TGN-003
issued: 2000-07-11
Date Modified: 2008-01-14
type: VocabularyEncodingScheme
comment: The set of places specified by the Getty Thesaurus of Geographic Names.

UDC
Has Version: UDC-003
issued: 2000-07-11
Date Modified: 2008-01-14
comment: The set of conceptual resources specified by the Universal Decimal Classification.
type: VocabularyEncodingScheme

URI
Has Version: URI-003
issued: 2000-07-11
Date Modified: 2008-01-14
type: Datatype
comment: The set of identifiers constructed according to the generic syntax for Uniform Resource Identifiers as specified by the Internet Engineering Task Force.

W3C-DTF
issued: 2000-07-11
Has Version: W3CDTF-003
type: Datatype
comment: The set of dates and times constructed according to the W3C Date and Time Formats Specification.
Date Modified: 2008-01-14

Abstract
Has Version: abstract-003
issued: 2000-07-11
Date Modified: 2008-01-14
comment: A summary of the resource.
type: Property
subPropertyOf: description
subPropertyOf: Description

Access Rights
Has Version: accessRights-002
description: Access Rights may include information regarding access or restrictions based on privacy, security, or other policies.
issued: 2003-02-15
Date Modified: 2008-01-14
type: Property
comment: Information about who can access the resource or an indication of its security status.
range: Rights Statement
subPropertyOf: rights
subPropertyOf: Rights

Accrual Method
Has Version: accrualMethod-003
Date Modified: 2010-10-11
issued: 2005-06-13
comment: The method by which items are added to a collection.
domain: Collection
type: Property
range: Method of Accrual

Accrual Periodicity
Has Version: accrualPeriodicity-003
issued: 2005-06-13
Date Modified: 2010-10-11
comment: The frequency with which items are added to a collection.
type: Property
domain: Collection
range: Frequency

Accrual Policy
Has Version: accrualPolicy-003
Date Modified: 2010-10-11
issued: 2005-06-13
comment: The policy governing the addition of items to a collection.
type: Property
domain: Collection
range: Policy

Alternative Title
Has Version: alternative-003
issued: 2000-07-11
Date Modified: 2010-10-11
description: The distinction between titles and alternative titles is application-specific.
comment: An alternative name for the resource.
type: Property
subPropertyOf: title
range: Literal
subPropertyOf: Title

Audience
Has Version: audience-003
Date Modified: 2008-01-14
issued: 2001-05-21
comment: A class of entity for whom the resource is intended or useful.
type: Property
range: Agent Class

Date Available
Has Version: available-003
issued: 2000-07-11
Date Modified: 2008-01-14
comment: Date (often a range) that the resource became or will become available.
type: Property
range: Literal
subPropertyOf: date
subPropertyOf: Date

Bibliographic Citation
description: Recommended practice is to include sufficient bibliographic detail to identify the resource as unambiguously as possible.
Has Version: bibliographicCitation-002
issued: 2003-02-15
Date Modified: 2008-01-14
type: Property
comment: A bibliographic reference for the resource.
domain: Bibliographic Resource
subPropertyOf: identifier
subPropertyOf: Identifier
range: Literal

Conforms To
Has Version: conformsTo-003
issued: 2001-05-21
Date Modified: 2008-01-14
comment: An established standard to which the described resource conforms.
type: Property
range: Standard
subPropertyOf: Relation
subPropertyOf: relation

Contributor
description: Examples of a Contributor include a person, an organization, or a service.
Has Version: contributorT-001
issued: 2008-01-14
Date Modified: 2010-10-11
type: Property
comment: An entity responsible for making contributions to the resource.
range: Agent
subPropertyOf: contributor

Coverage
Has Version: coverageT-001
description: Spatial topic and spatial applicability may be a named place or a location specified by its geographic coordinates. Temporal topic may be a named period, date, or date range. A jurisdiction may be a named administrative entity or a geographic place to which the resource applies. Recommended best practice is to use a controlled vocabulary such as the Thesaurus of Geographic Names [TGN]. Where appropriate, named places or time periods can be used in preference to numeric identifiers such as sets of coordinates or date ranges.
issued: 2008-01-14
Date Modified: 2008-01-14
type: Property
comment: The spatial or temporal topic of the resource, the spatial applicability of the resource, or the jurisdiction under which the resource is relevant.
range: Location, Period, or Jurisdiction
subPropertyOf: coverage

Date Created
Has Version: created-003
issued: 2000-07-11
Date Modified: 2008-01-14
type: Property
comment: Date of creation of the resource.
range: Literal
subPropertyOf: date
subPropertyOf: Date

Creator
Has Version: creatorT-002
issued: 2008-01-14
Date Modified: 2010-10-11
comment: An entity primarily responsible for making the resource.
type: Property
range: Agent
subPropertyOf: creator
subPropertyOf: Contributor
equivalentProperty: maker
description: Examples of a Creator include a person, an organization, or a service.

Date
Has Version: dateT-001
description: Date may be used to express temporal information at any level of granularity. Recommended best practice is to use an encoding scheme, such as the W3CDTF profile of ISO 8601 [W3CDTF].
issued: 2008-01-14
Date Modified: 2008-01-14
type: Property
comment: A point or period of time associated with an event in the lifecycle of the resource.
range: Literal
subPropertyOf: date

Date Accepted
description: Examples of resources to which a Date Accepted may be relevant are a thesis (accepted by a university department) or an article (accepted by a journal).
Has Version: dateAccepted-002
issued: 2002-07-13
Date Modified: 2008-01-14
comment: Date of acceptance of the resource.
type: Property
subPropertyOf: Date
range: Literal
subPropertyOf: date

Date Copyrighted
Has Version: dateCopyrighted-002
issued: 2002-07-13
Date Modified: 2008-01-14
comment: Date of copyright.
type: Property
subPropertyOf: date
range: Literal
subPropertyOf: Date

Date Submitted
description: Examples of resources to which a Date Submitted may be relevant are a thesis (submitted to a university department) or an article (submitted to a journal).
Date Modified: 2008-01-14
Has Version: dateSubmitted-002
type: Property
comment: Date of submission of the resource.
issued: 2002-07-13
range: Literal
subPropertyOf: date
subPropertyOf: Date

Description
description: Description may include but is not limited to: an abstract, a table of contents, a graphical representation, or a free-text account of the resource.
Has Version: descriptionT-001
issued: 2008-01-14
Date Modified: 2008-01-14
type: Property
comment: An account of the resource.
subPropertyOf: description

Audience Education Level
Has Version: educationLevel-002
issued: 2002-07-13
Date Modified: 2008-01-14
type: Property
comment: A class of entity, defined in terms of progression through an educational or training context, for which the described resource is intended.
range: Agent Class
subPropertyOf: Audience

Extent
issued: 2000-07-11
Has Version: extent-003
Date Modified: 2008-01-14
comment: The size or duration of the resource.
type: Property
range: Size or Duration
subPropertyOf: format
subPropertyOf: Format

Format
description: Examples of dimensions include size and duration. Recommended best practice is to use a controlled vocabulary such as the list of Internet Media Types [MIME].
Has Version: formatT-001
issued: 2008-01-14
Date Modified: 2008-01-14
comment: The file format, physical medium, or dimensions of the resource.
range: Media Type or Extent
subPropertyOf: format
type: Property

Has Format
Has Version: hasFormat-003
issued: 2000-07-11
Date Modified: 2008-01-14
comment: A related resource that is substantially the same as the pre-existing described resource, but in another format.
type: Property
subPropertyOf: relation
subPropertyOf: Relation
note: This term is intended to be used with non-literal values as defined in the DCMI Abstract Model (http://dublincore.org/documents/abstract-model/). As of December 2007, the DCMI Usage Board is seeking a way to express this intention with a formal range declaration.

Has Part
Has Version: hasPart-003
issued: 2000-07-11
Date Modified: 2008-01-14
type: Property
comment: A related resource that is included either physically or logically in the described resource.
subPropertyOf: relation
subPropertyOf: Relation
note: This term is intended to be used with non-literal values as defined in the DCMI Abstract Model (http://dublincore.org/documents/abstract-model/). As of December 2007, the DCMI Usage Board is seeking a way to express this intention with a formal range declaration.

Has Version
Has Version: hasVersion-003
issued: 2000-07-11
Date Modified: 2008-01-14
comment: A related resource that is a version, edition, or adaptation of the described resource.
type: Property
subPropertyOf: relation
note: This term is intended to be used with non-literal values as defined in the DCMI Abstract Model (http://dublincore.org/documents/abstract-model/). As of December 2007, the DCMI Usage Board is seeking a way to express this intention with a formal range declaration.
subPropertyOf: Relation

Identifier
description: Recommended best practice is to identify the resource by means of a string conforming to a formal identification system.
Date Modified: 2008-01-14
issued: 2008-01-14
Has Version: identifierT-001
comment: An unambiguous reference to the resource within a given context.
type: Property
subPropertyOf: identifier
range: Literal

Instructional Method
description: Instructional Method will typically include ways of presenting instructional materials or conducting instructional activities, patterns of learner-to-learner and learner-to-instructor interactions, and mechanisms by which group and individual levels of learning are measured. Instructional methods include all aspects of the instruction and learning processes from planning and implementation through evaluation and feedback.
Has Version: instructionalMethod-002
issued: 2005-06-13
Date Modified: 2008-01-14
comment: A process, used to engender knowledge, attitudes and skills, that the described resource is designed to support.
type: Property
range: Method of Instruction

Is Format Of
issued: 2000-07-11
Has Version: isFormatOf-003
Date Modified: 2008-01-14
comment: A related resource that is substantially the same as the described resource, but in another format.
type: Property
subPropertyOf: relation
subPropertyOf: Relation
note: This term is intended to be used with non-literal values as defined in the DCMI Abstract Model (http://dublincore.org/documents/abstract-model/). As of December 2007, the DCMI Usage Board is seeking a way to express this intention with a formal range declaration.

Is Part Of
Has Version: isPartOf-003
issued: 2000-07-11
Date Modified: 2008-01-14
type: Property
comment: A related resource in which the described resource is physically or logically included.
subPropertyOf: relation
subPropertyOf: Relation
note: This term is intended to be used with non-literal values as defined in the DCMI Abstract Model (http://dublincore.org/documents/abstract-model/). As of December 2007, the DCMI Usage Board is seeking a way to express this intention with a formal range declaration.

Is Referenced By
issued: 2000-07-11
Has Version: isReferencedBy-003
Date Modified: 2008-01-14
type: Property
comment: A related resource that references, cites, or otherwise points to the described resource.
subPropertyOf: relation
subPropertyOf: Relation
note: This term is intended to be used with non-literal values as defined in the DCMI Abstract Model (http://dublincore.org/documents/abstract-model/). As of December 2007, the DCMI Usage Board is seeking a way to express this intention with a formal range declaration.

Is Replaced By
issued: 2000-07-11
Has Version: isReplacedBy-003
Date Modified: 2008-01-14
type: Property
comment: A related resource that supplants, displaces, or supersedes the described resource.
subPropertyOf: relation
subPropertyOf: Relation
note: This term is intended to be used with non-literal values as defined in the DCMI Abstract Model (http://dublincore.org/documents/abstract-model/). As of December 2007, the DCMI Usage Board is seeking a way to express this intention with a formal range declaration.

Is Required By
Has Version: isRequiredBy-003
issued: 2000-07-11
Date Modified: 2008-01-14
type: Property
comment: A related resource that requires the described resource to support its function, delivery, or coherence.
subPropertyOf: relation
subPropertyOf: Relation
note: This term is intended to be used with non-literal values as defined in the DCMI Abstract Model (http://dublincore.org/documents/abstract-model/). As of December 2007, the DCMI Usage Board is seeking a way to express this intention with a formal range declaration.

Is Version Of
Has Version: isVersionOf-003
issued: 2000-07-11
description: Changes in version imply substantive changes in content rather than differences in format.
Date Modified: 2008-01-14
type: Property
comment: A related resource of which the described resource is a version, edition, or adaptation.
subPropertyOf: relation
subPropertyOf: Relation
note: This term is intended to be used with non-literal values as defined in the DCMI Abstract Model (http://dublincore.org/documents/abstract-model/). As of December 2007, the DCMI Usage Board is seeking a way to express this intention with a formal range declaration.

Date Issued
Has Version: issued-003
issued: 2000-07-11
Date Modified: 2008-01-14
comment: Date of formal issuance (e.g., publication) of the resource.
type: Property
range: Literal
subPropertyOf: Date
subPropertyOf: date

Language
description: Recommended best practice is to use a controlled vocabulary such as RFC 4646 [RFC4646].
Has Version: languageT-001
issued: 2008-01-14
Date Modified: 2008-01-14
type: Property
comment: A language of the resource.
range: Linguistic System
subPropertyOf: language

License
Has Version: license-002
issued: 2004-06-14
Date Modified: 2008-01-14
comment: A legal document giving official permission to do something with the resource.
type: Property
range: License Document
subPropertyOf: rights
subPropertyOf: Rights

Mediator
description: In an educational context, a mediator might be a parent, teacher, teaching assistant, or care-giver.
Has Version: mediator-003
issued: 2001-05-21
Date Modified: 2008-01-14
type: Property
comment: An entity that mediates access to the resource and for whom the resource is intended or useful.
range: Agent Class
subPropertyOf: Audience

Medium
Has Version: medium-003
issued: 2000-07-11
Date Modified: 2008-01-14
type: Property
comment: The material or physical carrier of the resource.
domain: Physical Resource
subPropertyOf: format
range: Physical Medium
subPropertyOf: Format

Date Modified
Has Version: modified-003
issued: 2000-07-11
Date Modified: 2008-01-14
type: Property
comment: Date on which the resource was changed.
range: Literal
subPropertyOf: date
subPropertyOf: Date

Provenance
Has Version: provenance-002
description: The statement may include a description of any changes successive custodians made to the resource.
issued: 2004-09-20
Date Modified: 2008-01-14
type: Property
comment: A statement of any changes in ownership and custody of the resource since its creation that are significant for its authenticity, integrity, and interpretation.
range: Provenance Statement

Publisher
description: Examples of a Publisher include a person, an organization, or a service.
Date Modified: 2010-10-11
issued: 2008-01-14
Has Version: publisherT-001
comment: An entity responsible for making the resource available.
type: Property
range: Agent
subPropertyOf: publisher

References
issued: 2000-07-11
Has Version: references-003
Date Modified: 2008-01-14
comment: A related resource that is referenced, cited, or otherwise pointed to by the described resource.
type: Property
subPropertyOf: relation
subPropertyOf: Relation
note: This term is intended to be used with non-literal values as defined in the DCMI Abstract Model (http://dublincore.org/documents/abstract-model/). As of December 2007, the DCMI Usage Board is seeking a way to express this intention with a formal range declaration.

Relation
description: Recommended best practice is to identify the related resource by means of a string conforming to a formal identification system.
Has Version: relationT-001
Date Modified: 2008-01-14
issued: 2008-01-14
comment: A related resource.
type: Property
note: This term is intended to be used with non-literal values as defined in the DCMI Abstract Model (http://dublincore.org/documents/abstract-model/). As of December 2007, the DCMI Usage Board is seeking a way to express this intention with a formal range declaration.
subPropertyOf: relation

Replaces
Has Version: replaces-003
issued: 2000-07-11
Date Modified: 2008-01-14
comment: A related resource that is supplanted, displaced, or superseded by the described resource.
type: Property
subPropertyOf: relation
subPropertyOf: Relation
note: This term is intended to be used with non-literal values as defined in the DCMI Abstract Model (http://dublincore.org/documents/abstract-model/). As of December 2007, the DCMI Usage Board is seeking a way to express this intention with a formal range declaration.

Requires
Has Version: requires-003
issued: 2000-07-11
Date Modified: 2008-01-14
type: Property
comment: A related resource that is required by the described resource to support its function, delivery, or coherence.
subPropertyOf: relation
subPropertyOf: Relation
note: This term is intended to be used with non-literal values as defined in the DCMI Abstract Model (http://dublincore.org/documents/abstract-model/). As of December 2007, the DCMI Usage Board is seeking a way to express this intention with a formal range declaration.

Rights
description: Typically, rights information includes a statement about various property rights associated with the resource, including intellectual property rights.
Has Version: rightsT-001
issued: 2008-01-14
Date Modified: 2008-01-14
type: Property
comment: Information about rights held in and over the resource.
range: Rights Statement
subPropertyOf: rights

Rights Holder
Has Version: rightsHolder-002
issued: 2004-06-14
Date Modified: 2008-01-14
type: Property
comment: A person or organization owning or managing rights over the resource.
range: Agent

Source
description: The described resource may be derived from the related resource in whole or in part. Recommended best practice is to identify the related resource by means of a string conforming to a formal identification system.
Has Version: sourceT-001
issued: 2008-01-14
Date Modified: 2008-01-14
type: Property
comment: A related resource from which the described resource is derived.
subPropertyOf: source
subPropertyOf: Relation
note: This term is intended to be used with non-literal values as defined in the DCMI Abstract Model (http://dublincore.org/documents/abstract-model/). As of December 2007, the DCMI Usage Board is seeking a way to express this intention with a formal range declaration.

Spatial Coverage
Has Version: spatial-003
issued: 2000-07-11
Date Modified: 2008-01-14
type: Property
comment: Spatial characteristics of the resource.
range: Location
subPropertyOf: coverage
subPropertyOf: Coverage

Subject
description: Typically, the subject will be represented using keywords, key phrases, or classification codes. Recommended best practice is to use a controlled vocabulary.
Has Version: subjectT-002
issued: 2008-01-14
Date Modified: 2012-06-14
type: Property
comment: The topic of the resource.
subPropertyOf: subject
note: This term is intended to be used with non-literal values as defined in the DCMI Abstract Model (http://dublincore.org/documents/abstract-model/). As of December 2007, the DCMI Usage Board is seeking a way to express this intention with a formal range declaration.

Table Of Contents
Has Version: tableOfContents-003
Date Modified: 2008-01-14
issued: 2000-07-11
comment: A list of subunits of the resource.
type: Property
subPropertyOf: description
subPropertyOf: Description

Temporal Coverage
issued: 2000-07-11
Has Version: temporal-003
Date Modified: 2008-01-14
comment: Temporal characteristics of the resource.
type: Property
range: Period of Time
subPropertyOf: coverage
subPropertyOf: Coverage

Title
issued: 2008-01-14
Has Version: titleT-002
Date Modified: 2010-10-11
comment: A name given to the resource.
type: Property
range: Literal
subPropertyOf: title

Type
description: Recommended best practice is to use a controlled vocabulary such as the DCMI Type Vocabulary [DCMITYPE]. To describe the file format, physical medium, or dimensions of the resource, use the Format element.
Has Version: typeT-001
issued: 2008-01-14
Date Modified: 2008-01-14
type: Property
comment: The nature or genre of the resource.
range: Class
subPropertyOf: type

Date Valid
Date Modified: 2008-01-14
Has Version: valid-003
issued: 2000-07-11
type: Property
comment: Date (often a range) of validity of a resource.
range: Literal
subPropertyOf: date
subPropertyOf: Date

WGS84 Geo Positioning: an RDF vocabulary
description: A vocabulary for representing latitude, longitude and altitude information in the WGS84 geodetic reference datum. Version $Id: wgs84_pos.rdf,v 1.22 2009/04/20 15:00:30 timbl Exp $. See http://www.w3.org/2003/01/geo/ for more details.
date: $Date: 2009/04/20 15:00:30 $
label: geo
comment: Recent changes to this namespace: $Log: wgs84_pos.rdf,v $ Revision 1.22 2009/04/20 15:00:30 timbl Remove the time bits which have been deal with elsewhere eg in iCal. Revision 1.21 2009/04/20 12:52:47 timbl try again Revision 1.20 2009/04/20 12:42:11 timbl Add Event (edited ages ago and never checked in), and location (following discussion http://chatlogs.planetrdf.com/swig/2009-04-20#T12-36-09) Revision 1.19 2009/04/20 12:36:31 timbl Add Event (edited ages ago and never checked in), and location (following discussion http://chatlogs.planetrdf.com/swig/2009-04-20#T12-36-09) Revision 1.18 2006/02/01 22:01:04 danbri Clarified that lat and long are decimal degrees, and that alt is decimal metres about local reference ellipsoid Revision 1.17 2004/02/06 17:38:12 danbri Fixed a bad commit screwup Revision 1.15 2003/04/19 11:24:08 danbri Fixed the typo even more. Revision 1.14 2003/04/19 11:16:56 danbri fixed a typo Revision 1.13 2003/02/19 22:27:27 connolly relaxed domain constraints on lat/long/alt from Point to SpatialThing Revision 1.12 2003/01/12 01:41:41 danbri Trying local copy of XSLT doc. Revision 1.11 2003/01/12 01:20:18 danbri added a link to morten's xslt rdfs viewer. Revision 1.10 2003/01/11 18:56:49 danbri Removed datatype range from lat and long properties, since they would have required each occurance of the property to mention the datatype. Revision 1.9 2003/01/11 11:41:31 danbri Another typo; repaired rdfs:Property to rdf:Property x4 Revision 1.8 2003/01/11 11:05:02 danbri Added an rdfs:range for each lat/long/alt property, http://www.w3.org/2001/XMLSchema#float Revision 1.7 2003/01/10 20:25:16 danbri Longer rdfs:comment for Point, trying to be Earth-centric and neutral about coordinate system(s) at the same time. Feedback welcomed. Revision 1.6 2003/01/10 20:18:30 danbri Added CVS log comments into the RDF/XML as an rdfs:comment property of the vocabulary. Note that this is not common practice (but seems both harmless and potentially useful). revision 1.…

SpatialThing
type: Class
comment: Anything with spatial extent, i.e. size, shape, or position. e.g. people, places, bowling balls, as well as abstract areas like cubes.

point
type: Class
subclass of: SpatialThing
comment: A point, typically described using a coordinate system relative to Earth, such as WGS84.
comment: Uniquely identified by lat/long/alt. i.e. spaciallyIntersects(P1, P2) :- lat(P1, LAT), long(P1, LONG), alt(P1, ALT), lat(P2, LAT), long(P2, LONG), alt(P2, ALT). sameThing(P1, P2) :- type(P1, Point), type(P2, Point), spaciallyIntersects(P1, P2).

latitude
type: Property
domain: SpatialThing
comment: The WGS84 latitude of a SpatialThing (decimal degrees).

location
type: Property
range: SpatialThing
subPropertyOf: based near
comment: The relation between something and the point, or other geometrical thing in space, where it is. For example, the realtionship between a radio tower and a Point with a given lat and long. Or a relationship between a park and its outline as a closed arc of points, or a road and its location as a arc (a sequence of points). Clearly in practice there will be limit to the accuracy of any such statement, but one would expect an accuracy appropriate for the size of the object and uses such as mapping .

longitude
type: Property
domain: SpatialThing
comment: The WGS84 longitude of a SpatialThing (decimal degrees).

altitude
type: Property
domain: SpatialThing
comment: The WGS84 altitude of a SpatialThing (decimal meters above the local reference ellipsoid).

lat/long
comment: A comma-separated representation of a latitude, longitude coordinate.
type: Property

num employees
type: Property